{"text_format":"1","workbook":"xlsx","n_sheets":7,"sheets":["Dolny układ jezdny","Obliczenia-dolny","OVERLINE","Overline - Obliczenia","QUANTUM","Quantum - obliczenia","Opisy"],"not_rendered":{"charts":0,"images":44,"macros":1,"external_links":0,"defined_names":58,"comments":0,"pivot_tables":0},"unopened":[],"bounds":{"document_bytes":16777216,"sheet_cells":100000,"rows_first":2000,"rows_last":500,"rows_between":2000,"halvings":0,"cell_chars":16384,"cell_head_chars":4096},"cells_cut":0,"cells_raw":0,"read":"whole","date_system":"1900"}

{"sheet":"Dolny układ jezdny","index":0,"n_rows":70,"n_cols":13,"rows_kept":70,"cut":false,"hidden":false,"merged":[[6,3,6,4],[10,2,10,3],[16,2,16,3],[28,2,28,4],[28,5,28,12],[34,2,34,12],[9,10,11,10],[18,12,20,12],[18,11,20,11],[12,10,14,10],[9,11,11,11],[12,12,14,12],[18,10,20,10],[12,11,14,11],[15,10,17,10],[15,11,17,11],[15,12,17,12],[18,4,19,4],[21,2,26,4],[63,2,69,6],[56,2,56,4],[61,2,61,4],[62,2,62,4],[59,2,59,4],[60,2,60,6],[57,2,57,6],[58,2,58,4],[51,4,51,6],[52,8,53,8],[52,11,55,11],[56,11,58,11],[54,9,55,9],[52,10,55,10],[56,10,58,10],[52,9,53,9],[59,11,61,11],[52,12,55,12],[54,8,55,8],[55,2,55,4],[53,2,53,6],[54,2,54,6]]}
[]
[]
[]
[]
[]
[]
[null,null,{"$f":"Opisy!A11","v":"Wybierz system:"}]
[]
["1."]
[]
[null,null,{"$f":"Opisy!A14","v":"Wymiary otworu"},null,null,"SD",{"$f":"HLOOKUP('Obliczenia-dolny'!$B$44,'Obliczenia-dolny'!$L$1:$AI$46,5,FALSE)","v":1014.3333333333334},{"$f":"Opisy!$A$46","v":"mm"},{"$f":"Opisy!A51","v":"Szerokość drzwi"}]
["2.",null,{"$f":"Opisy!A18","v":"WO [mm]"},2700,{"$f":"IF(D12>2740,Opisy!A15,IF(D12<1000,Opisy!A16,Opisy!A17))","v":"<- OK"},"WD",{"$f":"HLOOKUP('Obliczenia-dolny'!$B$44,'Obliczenia-dolny'!$L$1:$AI$46,6,FALSE)","v":2660},{"$f":"Opisy!$A$46","v":"mm"},{"$f":"Opisy!A52","v":"Wysokość drzwi"}]
["3.",null,{"$f":"Opisy!A19","v":"SO [mm]"},3000,{"$f":"IF(AND('Obliczenia-dolny'!C44='Obliczenia-dolny'!B11,'Dolny układ jezdny'!D13>3000),Opisy!A76,IF(D13>6000,Opisy!A20,IF(D13<1000,Opisy!A16,Opisy!A17)))","v":"<- OK"},"SW18",{"$f":"HLOOKUP('Obliczenia-dolny'!$B$44,'Obliczenia-dolny'!$L$1:$AI$46,7,FALSE)","v":"-"},{"$f":"Opisy!$A$46","v":"mm"},{"$f":"Opisy!A53","v":"Szer. wyp. 18mm"}]
[null,null,null,null,null,"SW16",{"$f":"HLOOKUP('Obliczenia-dolny'!$B$44,'Obliczenia-dolny'!$L$1:$AI$46,8,FALSE)","v":"-"},{"$f":"Opisy!$A$46","v":"mm"},{"$f":"Opisy!A54","v":"Szer. wyp. 16mm"}]
[null,null,null,null,null,"SW12",{"$f":"HLOOKUP('Obliczenia-dolny'!$B$44,'Obliczenia-dolny'!$L$1:$AI$46,9,FALSE)","v":"-"},{"$f":"Opisy!$A$46","v":"mm"},{"$f":"Opisy!A55","v":"Szer. wyp. 12mm"}]
{"$rows_left_out":56}
{"sheet":"Obliczenia-dolny","index":1,"n_rows":46,"n_cols":37,"rows_kept":46,"cut":false,"hidden":true,"merged":[[29,11,29,34],[0,3,0,6],[4,3,4,6],[25,5,26,7],[1,5,2,5],[1,3,2,4],[23,36,27,36],[23,11,23,34],[24,11,24,34],[0,36,3,36],[1,12,1,14],[1,15,1,16],[1,22,1,23],[1,24,1,26],[1,27,1,28],[1,29,1,30],[25,11,25,34],[26,11,26,34],[27,11,27,34]]}
[1,"ERGO 18mm",null,"Wybór rozwiązania ze szczotką",null,null,null,null,{"$f":"L6/L5","v":2.6138224697019328},null,1,1,4,5,13,2,3,12,18,19,23,24,6,14,7,8,15,9,16,10,17,20,21,22,11,1,"Aktualnie wybrany system"]
[2,"NOVO II 18mm",null,true,null,{"$f":"IF(D2,3,0)","v":3},"Tak",null,null,"rączka",2,"ERGO","NOVO",null,null,"NOVO II",null,null,null,"NOVO 10","71 ARCO","85 FALDA","VISTA",null,"COTE",null,null,"NERO",null,"CARO",null,"FORM","TRAFO","FlatLine","Mito/Mito+",2]
[3,"NOVO II 12+4mm",null,null,null,null,"Nie",null,null,"system",3,"18mm","18mm","16mm","18/4mm","18mm","12+4mm","-","-","10/4mm","10/4mm",{"$f":"U3","v":"10/4mm"},"18mm","18/4mm","18mm","16mm","18/4mm","18mm","18/4mm","18mm","18/4mm","10/4mm","10/4mm","10/4mm","10/4mm",3]
[4,"NOVO S 18mm",null,null,null,null,null,null,null,"waga 1mb. [kg]",4,0.219,0.33800000000000002,0.33800000000000002,0.33800000000000002,0.33200000000000002,0.33200000000000002,"-","-",0.35,0.41799999999999998,0.46300000000000002,0.38,0.38,0.35699999999999998,0.35699999999999998,0.35699999999999998,0.39300000000000002,0.39300000000000002,0.41399999999999998,0.41399999999999998,0.36199999999999999,0.34100000000000003,0.40500000000000003,0,4]
[5,"NOVO S 16mm",null,"Łączniki",null,null,null,null,null,"SD",5,{"$f":"IF($D$2,('Dolny układ jezdny'!$D$13-3+'Dolny układ jezdny'!$D$19*L21)/'Dolny układ jezdny'!$D$18,('Dolny układ jezdny'!$D$13+'Dolny układ jezdny'!$D$19*L21)/'Dolny układ jezdny'!$D$18)","v":1017.6666666666666},{"$f":"IF($D$2,('Dolny układ jezdny'!$D$13-3+'Dolny układ jezdny'!$D$19*M21)/'Dolny układ jezdny'!$D$18,('Dolny układ jezdny'!$D$13+'Dolny układ jezdny'!$D$19*M21)/'Dolny układ jezdny'!$D$18)","v":1021.6666666666666},{"$f":"IF($D$2,('Dolny układ jezdny'!$D$13-3+'Dolny układ jezdny'!$D$19*N21)/'Dolny układ jezdny'!$D$18,('Dolny układ jezdny'!$D$13+'Dolny układ jezdny'!$D$19*N21)/'Dolny układ jezdny'!$D$18)","v":1021.6666666666666},{"$f":"IF($D$2,('Dolny układ jezdny'!$D$13-3+'Dolny układ jezdny'!$D$19*O21)/'Dolny układ jezdny'!$D$18,('Dolny układ jezdny'!$D$13+'Dolny układ jezdny'!$D$19*O21)/'Dolny układ jezdny'!$D$18)","v":1021.6666666666666},{"$f":"IF($D$2,('Dolny układ jezdny'!$D$13-3+'Dolny układ jezdny'!$D$19*P21)/'Dolny układ jezdny'!$D$18,('Dolny układ jezdny'!$D$13+'Dolny układ jezdny'!$D$19*P21)/'Dolny układ jezdny'!$D$18)","v":1021.6666666666666},{"$f":"IF($D$2,('Dolny układ jezdny'!$D$13-3+'Dolny układ jezdny'!$D$19*Q21)/'Dolny układ jezdny'!$D$18,('Dolny układ jezdny'!$D$13+'Dolny układ jezdny'!$D$19*Q21)/'Dolny układ jezdny'!$D$18)","v":1021.6666666666666},"-","-",{"$f":"IF($D$2,('Dolny układ jezdny'!$D$13-3+'Dolny układ jezdny'!$D$19*T21)/'Dolny układ jezdny'!$D$18,('Dolny układ jezdny'!$D$13+'Dolny układ jezdny'!$D$19*T21)/'Dolny układ jezdny'!$D$18)","v":1019},{"$f":"IF($D$2,('Dolny układ jezdny'!$D$13-3+'Dolny układ jezdny'!$D$19*U21)/'Dolny układ jezdny'!$D$18,('Dolny układ jezdny'!$D$13+'Dolny układ jezdny'!$D$19*U21)/'Dolny układ jezdny'!$D$18)","v":1020.3333333333334},{"$f":"IF($D$2,('Dolny układ jezdny'!$D$13-3+'Dolny układ jezdny'!$D$19*V21)/'Dolny układ jezdny'!$D$18,('Dolny układ jezdny'!$D$13+'Dolny układ jezdny'!$D$19*V21)/'Dolny układ jezdny'!$D$18)","v":1020.3333333333334},{"$f":"IF($D$2,('Dolny układ jezdny'!$D$13-3+'Dolny układ jezdny'!$D$19*W21)/'Dolny układ jezdny'!$D$18,('Dolny układ jezdny'!$D$13+'Dolny układ jezdny'!$D$19*W21)/'Dolny układ jezdny'!$D$18)","v":1019},{"$f":"IF($D$2,('Dolny układ jezdny'!$D$13-3+'Dolny układ jezdny'!$D$19*X21)/'Dolny układ jezdny'!$D$18,('Dolny układ jezdny'!$D$13+'Dolny układ jezdny'!$D$19*X21)/'Dolny układ jezdny'!$D$18)","v":1019},{"$f":"IF($D$2,('Dolny układ jezdny'!$D$13-3+'Dolny układ jezdny'!$D$19*Y21)/'Dolny układ jezdny'!$D$18,('Dolny układ jezdny'!$D$13+'Dolny układ jezdny'!$D$19*Y21)/'Dolny układ jezdny'!$D$18)","v":1018.3333333333334},{"$f":"IF($D$2,('Dolny układ jezdny'!$D$13-3+'Dolny układ jezdny'!$D$19*Z21)/'Dolny układ jezdny'!$D$18,('Dolny układ jezdny'!$D$13+'Dolny układ jezdny'!$D$19*Z21)/'Dolny układ jezdny'!$D$18)","v":1018.3333333333334},{"$f":"IF($D$2,('Dolny układ jezdny'!$D$13-3+'Dolny układ jezdny'!$D$19*AA21)/'Dolny układ jezdny'!$D$18,('Dolny układ jezdny'!$D$13+'Dolny układ jezdny'!$D$19*AA21)/'Dolny układ jezdny'!$D$18)","v":1018.3333333333334},{"$f":"IF($D$2,('Dolny układ jezdny'!$D$13-3+'Dolny układ jezdny'!$D$19*AB21)/'Dolny układ jezdny'!$D$18,('Dolny układ jezdny'!$D$13+'Dolny układ jezdny'!$D$19*AB21)/'Dolny układ jezdny'!$D$18)","v":1018.3333333333334},{"$f":"IF($D$2,('Dolny układ jezdny'!$D$13-3+'Dolny układ jezdny'!$D$19*AC21)/'Dolny układ jezdny'!$D$18,('Dolny układ jezdny'!$D$13+'Dolny układ jezdny'!$D$19*AC21)/'Dolny układ jezdny'!$D$18)","v":1018.3333333333334},{"$f":"IF($D$2,('Dolny układ jezdny'!$D$13-3+'Dolny układ jezdny'!$D$19*AD21)/'Dolny układ jezdny'!$D$18,('Dolny układ jezdny'!$D$13+'Dolny układ jezdny'!$D$19*AD21)/'Dolny układ jezdny'!$D$18)","v":1021.6666666666666},{"$f":"IF($D$2,('Dolny układ jezdny'!$D$13-3+'Dolny układ jezdny'!$D$19*AE21)/'Dolny układ jezdny'!$D$18,('Dolny układ jezdny'!$D$13+'Dolny układ jezdny'!$D$19*AE21)/'Dolny układ jezdny'!$D$18)","v":1021.6666666666666},{"$f":"IF($D$2,('Dolny układ jezdny'!$D$13-3+'Dolny układ jezdny'!$D$19*AF21)/'Dolny układ jezdny'!$D$18,('Dolny układ jezdny'!$D$13+'Dolny układ jezdny'!$D$19*AF21)/'Dolny układ jezdny'!$D$18)","v":1014.3333333333334},{"$f":"IF($D$2,('Dolny układ jezdny'!$D$13-3+'Dolny układ jezdny'!$D$19*AG21)/'Dolny układ jezdny'!$D$18,('Dolny układ jezdny'!$D$13+'Dolny układ jezdny'!$D$19*AG21)/'Dolny układ jezdny'!$D$18)","v":1019},{"$f":"IF($D$2,('Dolny układ jezdny'!$D$13-3+'Dolny układ jezdny'!$D$19*AH21)/'Dolny układ jezdny'!$D$18,('Dolny układ jezdny'!$D$13+'Dolny układ jezdny'!$D$19*AH21)/'Dolny układ jezdny'!$D$18)","v":1017.6666666666666},{"$f":"IF($D$2,('Dolny układ jezdny'!$D$13-3+'Dolny układ jezdny'!$D$19*AI21)/'Dolny układ jezdny'!$D$18,('Dolny układ jezdny'!$D$13+'Dolny układ jezdny'!$D$19*AI21)/'Dolny układ jezdny'!$D$18)","v":1019},5,{"$f":"'Dolny układ jezdny'!G11","v":1014.3333333333334}]
[6,"VISTA 18mm",null,false,null,"TAK/NIE",null,null,null,"WD",6,{"$f":"'Dolny układ jezdny'!$D$12-40","v":2660},{"$f":"'Dolny układ jezdny'!$D$12-40","v":2660},{"$f":"'Dolny układ jezdny'!$D$12-40","v":2660},{"$f":"'Dolny układ jezdny'!$D$12-40","v":2660},{"$f":"'Dolny układ jezdny'!$D$12-40","v":2660},{"$f":"'Dolny układ jezdny'!$D$12-40","v":2660},"-","-",{"$f":"'Dolny układ jezdny'!$D$12-40","v":2660},{"$f":"'Dolny układ jezdny'!$D$12-40","v":2660},{"$f":"'Dolny układ jezdny'!$D$12-40","v":2660},{"$f":"'Dolny układ jezdny'!$D$12-40","v":2660},{"$f":"'Dolny układ jezdny'!$D$12-40","v":2660},{"$f":"'Dolny układ jezdny'!$D$12-40","v":2660},{"$f":"'Dolny układ jezdny'!$D$12-40","v":2660},{"$f":"'Dolny układ jezdny'!$D$12-40","v":2660},{"$f":"'Dolny układ jezdny'!$D$12-40","v":2660},{"$f":"'Dolny układ jezdny'!$D$12-40","v":2660},{"$f":"'Dolny układ jezdny'!$D$12-40","v":2660},{"$f":"'Dolny układ jezdny'!$D$12-40","v":2660},{"$f":"'Dolny układ jezdny'!$D$12-40","v":2660},{"$f":"'Dolny układ jezdny'!$D$12-40","v":2660},{"$f":"'Dolny układ jezdny'!$D$12-40","v":2660},{"$f":"'Dolny układ jezdny'!$D$12-12","v":2688},6,{"$f":"'Dolny układ jezdny'!G12","v":2660}]
[7,"COTE 18mm",null,"Wybór łącznika",null,null,null,null,null,"SW18",7,{"$f":"L5-7","v":1010.6666666666666},{"$f":"M5-36","v":985.66666666666663},"-",{"$f":"O5-36","v":985.66666666666663},{"$f":"P5-30","v":991.66666666666663},"-","-","-","-","-","-",{"$f":"W5-31","v":988},{"$f":"X5-31","v":988},{"$f":"Y5-36","v":982.33333333333337},"-",{"$f":"AA5-36","v":982.33333333333337},{"$f":"AB5-31","v":987.33333333333337},{"$f":"AC5-31","v":987.33333333333337},{"$f":"AD5-31","v":990.66666666666663},{"$f":"AE5-31","v":990.66666666666663},"-","-","-",{"$f":"AI5","v":1019},7,{"$f":"'Dolny układ jezdny'!G13","v":"-"}]
[8,"COTE 16mm",null,null,8,"A-T18-300-XX",1,"A",null,"SW16",8,"-","-",{"$f":"N5-21","v":1000.6666666666666},"-","-","-","-","-","-","-","-","-","-","-",{"$f":"Z5-21","v":997.33333333333337},"-",{"$f":"W8","v":"-"},{"$f":"X8","v":"-"},"-","-","-","-","-",{"$f":"AI5","v":1019},8,{"$f":"'Dolny układ jezdny'!G14","v":"-"}]
[9,"NERO 18mm",null,null,null,"A-H18-300-XX",2,"A",null,"SW12",9,"-","-","-","-","-",{"$f":"Q5-7","v":1014.6666666666666},"-","-","-","-","-","-","-","-","-","-","-","-","-","-","-","-","-","-",9,{"$f":"'Dolny układ jezdny'!G15","v":"-"}]
[10,"CARO 18mm",null,null,null,"A-H16-300-XX",3,"B",null,"SW10",10,"-","-","-","-","-","-","-","-",{"$f":"T5-21","v":998},{"$f":"U5-43","v":977.33333333333337},{"$f":"V5-43","v":977.33333333333337},"-","-","-","-","-","-","-","-","-",{"$f":"AF5-27","v":987.33333333333337},{"$f":"AG5-21","v":998},{"$f":"AH5-36","v":981.66666666666663},"-",10,{"$f":"'Dolny układ jezdny'!G16","v":987.33333333333337}]
[11,"MITO/MITO PLUS",null,"-",null,"A-HRS18-YYY-XX",4,"C",null,"SW4",11,"-","-","-",{"$f":"O5-24","v":997.66666666666663},"-",{"$f":"Q5-32","v":989.66666666666663},"-","-",{"$f":"T5-24","v":995},{"$f":"U10-3","v":974.33333333333337},{"$f":"V10-3","v":974.33333333333337},"-",{"$f":"X5-23","v":996},"-","-",{"$f":"AA5-23","v":995.33333333333337},"-",{"$f":"AC5-23","v":995.33333333333337},"-",{"$f":"AE5-23","v":998.66666666666663},{"$f":"AF5-30","v":984.33333333333337},{"$f":"AG5-24","v":995},{"$f":"AH5-39","v":978.66666666666663},"-",11,{"$f":"'Dolny układ jezdny'!G17","v":984.33333333333337}]
[12,{"$f":"Opisy!A71","v":"------RAMOWE 18mm--------------"},null,"-",null,"A-HR18-300-XX",5,"C",null,"WW18",12,{"$f":"L6-3","v":2657},{"$f":"M6-3","v":2657},"-",{"$f":"O6-69","v":2591},{"$f":"P6-3","v":2657},"-","-","-","-","-","-",{"$f":"M12","v":2657},{"$f":"O12","v":2591},{"$f":"W12","v":2657},"-",{"$f":"X12","v":2591},2657,2591,{"$f":"W12","v":2657},{"$f":"X12","v":2591},"-","-","-",{"$f":"AI6","v":2688},12,{"$f":"'Dolny układ jezdny'!G18","v":"-"}]
[13,"NOVO S 18/4mm",null,"-",null,"A-HRS10-YYY-XX",6,"D",null,"WW16",13,"-","-",{"$f":"N6-3","v":2657},"-","-","-","-","-","-","-","-","-","-","-",{"$f":"N13","v":2657},"-","-","-","-","-","-","-","-",{"$f":"AI6","v":2688},13,{"$f":"'Dolny układ jezdny'!G19","v":"-"}]
[14,"VISTA 18/4mm",null,null,null,"A-HR10-YYY-XX",7,"D",null,"WW12",14,"-","-","-","-","-",{"$f":"Q6-3","v":2657},"-","-","-","-","-","-","-","-","-","-","-","-","-","-","-","-","-","-",14,{"$f":"'Dolny układ jezdny'!G20","v":"-"}]
[15,"COTE 18/4mm",null,null,null,"A-HR10FL-YYY-XX",8,"E",null,"WW10",15,"-","-","-","-","-","-","-","-",{"$f":"T6-60","v":2600},{"$f":"T15","v":2600},{"$f":"U15","v":2600},"-","-","-","-","-","-","-","-","-",{"$f":"AF6-60","v":2600},{"$f":"AG6-60","v":2600},{"$f":"AH6-5","v":2655},"-",15,{"$f":"'Dolny układ jezdny'!G21","v":2600}]
{"$rows_left_out":32}
{"sheet":"OVERLINE","index":2,"n_rows":70,"n_cols":13,"rows_kept":70,"cut":false,"hidden":false,"merged":[[44,2,45,9],[30,10,31,11],[30,12,31,12],[44,10,45,11],[44,12,45,12],[34,7,34,12],[30,2,31,9],[26,9,26,10],[26,11,26,12],[40,5,40,6],[40,7,40,8],[40,9,40,10],[40,11,40,12],[26,5,26,6],[26,7,26,8],[35,5,35,12],[36,5,36,6],[36,7,36,8],[36,9,36,10],[36,11,36,12],[17,1,17,3],[18,1,18,3],[21,5,21,12],[22,9,22,10],[22,11,22,12],[22,5,22,6],[22,7,22,8],[20,7,20,12],[14,11,15,12],[10,11,11,12],[12,11,13,12],[19,1,19,3],[10,10,11,10],[12,10,13,10],[14,8,15,8],[14,9,15,9],[14,10,15,10],[10,8,11,8],[10,9,11,9],[12,9,13,9],[12,8,13,8],[16,1,16,3]]}
[]
[]
[]
[]
[]
[]
[]
[]
[null,null,null,"1.",{"$f":"Opisy!A11","v":"Wybierz system:"}]
[]
[null,null,null,null,null,null,null,null,{"$f":"Opisy!A80","v":"Wysokość:"},2200,"mm",{"$f":"Opisy!A83","v":"Maksimum 3000mm"}]
[null,null,null,"2.",{"$f":"Opisy!A77","v":"Wymiary dla:"}]
[null,null,null,null,null,{"$f":"Opisy!A78","v":"Wnęki"},null,null,{"$f":"Opisy!A81","v":"Szerokość:"},1800,"mm",{"$f":"Opisy!A84","v":"Maksimum 4050mm"}]
[null,null,null,null,null,{"$f":"Opisy!A79","v":"Korpusu szafy"}]
[null,null,null,null,null,null,null,null,{"$f":"Opisy!A82","v":"Głębokość:"},700,"mm",{"$f":"Opisy!A137","v":"Minimum 300mm"}]
{"$rows_left_out":56}
{"sheet":"Overline - Obliczenia","index":3,"n_rows":21,"n_cols":22,"rows_kept":21,"cut":false,"hidden":true,"merged":[[17,14,17,15],[17,16,17,17],[17,18,17,19],[17,20,17,21],[6,14,6,15],[6,16,6,17],[6,18,6,19],[6,20,6,21],[12,14,12,21],[13,14,13,15],[13,16,13,17],[13,18,13,19],[13,20,13,21],[4,5,4,7],[1,14,1,21],[2,14,2,15],[2,16,2,17],[2,18,2,19],[2,20,2,21],[1,5,1,7],[2,5,2,7],[3,5,3,7],[14,5,15,6],[10,5,10,7],[11,5,11,7],[12,5,12,7],[6,5,6,6],[7,5,7,6],[8,5,8,6]]}
[]
[null,"Wybrany system:",1,{"$f":"VLOOKUP(C2,A8:B38,2,FALSE)","v":"OVERILINE"},null,"Grubość płyty na korpus Gp",null,null,{"$f":"VLOOKUP(H16,F17:G19,2,FALSE)","v":18},null,null,null,null,null,"Wymiary szafy - drzwi nakładane"]
[null,"Typ zabudowy:",2,null,null,"Wysokość cokołu Hc ",null,null,{"$f":"OVERLINE!E18","v":100},null,null,null,null,null,"Korpus:",null,"Wieniec górny i dolny",null,"Bok lewy",null,"Przegrody pionowe"]
[null,"Układ drzwi",null,null,null,"Grubość płyty drzwi Gd",null,null,{"$f":"VLOOKUP(I16,F17:G19,2,FALSE)","v":18},null,null,null,null,null,"Wysokość Ws",{"$f":"Wys.szafy","v":2200},"Szerokość",{"$f":"P9","v":1764},"Wysokość",{"$f":"Wys.szafy","v":2200},"Wysokość",{"$f":"Wys.uzyt.szafy","v":2019}]
[null,null,null,null,null,"Szerokość zakładki Z",null,null,{"$f":"OVERLINE!E20","v":20},null,null,null,null,null,"Szerokość Ss",{"$f":"Szer.szafy","v":1800},"Głębokość",{"$f":"P10","v":638},"Głębokość",{"$f":"Gleb.uzyt.szafy+35","v":673},"Głębokość",{"$f":"Gleb.uzyt.szafy-10","v":628}]
[null,"Systemy podwieszane",null,null,null,null,null,null,null,null,null,null,null,null,"Głębokość Gs",{"$f":"Gleb.szafy","v":700},"Grubość",{"$f":"Grub.plyty.korp","v":18},"Grubość",{"$f":"Grub.plyty.korp","v":18},"Grubość",{"$f":"Grub.plyty.korp","v":18}]
[null,null,null,null,null,"Wysokość szafy",null,{"$f":"IF(AND(OR(Wybrany_System_podw=1,Wybrany_System_podw=2),Typ_zabudowy=1),Wys.wprowadzana-25,Wys.wprowadzana)","v":2200},null,null,null,null,null,null,"Wnętrze korpusu:",null,"Wymiary cokołu",null,"Bok prawy",null,"Wymiary drzwi"]
[null,null,null,null,null,"Szerokość szafy",null,{"$f":"IF(AND(OR(Wybrany_System_podw=1,Wybrany_System_podw=2),Typ_zabudowy=1),Szer.wprowadzana-7,Szer.wprowadzana)","v":1800},null,null,null,null,null,null,"Wysokość Wu",{"$f":"Wys.uzyt.szafy","v":2019},"Wysokość",{"$f":"Wys.cokolu","v":100},"Wysokość",{"$f":"Wys.szafy","v":2200},"Wysokość Wd",{"$f":"IF(Wybrany_System_podw=1,Wys.szafy-Wys.cokolu-Grub.plyty.korp+41,IF(Wybrany_System_podw=2,Wys.szafy-Wys.cokolu-Grub.plyty.korp+39,\"-\"))","v":2123}]
[1,"OVERILINE",null,null,null,"Głębokość szafy",null,{"$f":"Gleb.wprowadzana","v":700},null,null,null,null,null,null,"Szerokość Sw",{"$f":"Szer.uzyt.szafy","v":1764},"Długość",{"$f":"P9","v":1764},"Głębokość",{"$f":"Gleb.uzyt.szafy+6","v":644},"Szerokość Sd",{"$f":"(Szer.szafy+Szer.zakladki)/2","v":910}]
[2,"OVERLINE PLUS",null,null,null,null,null,null,null,null,null,null,null,null,"Głębokość Gu",{"$f":"Gleb.uzyt.szafy","v":638},"Grubość",{"$f":"Grub.plyty.korp","v":18},"Grubość",{"$f":"Grub.plyty.korp","v":18},"Grubość Gd",{"$f":"Grub.drzwi","v":18}]
[null,null,null,null,null,"Wysokość użyteczna szafy",null,null,{"$f":"Wys.szafy-Wys.cokolu-2*Grub.plyty.korp-45","v":2019}]
[null,null,null,null,null,"Szerokość użyteczna szafy",null,null,{"$f":"Szer.szafy-2*Grub.plyty.korp","v":1764}]
[null,null,null,null,null,"Głębokość użyteczna szafy",null,null,{"$f":"Gleb.szafy-Grub.drzwi-44","v":638},null,null,null,null,null,"Wymiary szafy - drzwi wpuszczane"]
[null,null,null,null,null,null,null,null,null,null,null,null,null,null,"Korpus:",null,"Wieniec górny i dolny",null,"Bok lewy",null,"Przegrody pionowe"]
[null,null,null,null,null,"Grubości płyt",null,"korpus","drzwi",null,null,null,null,null,"Wysokość Ws",{"$f":"Wys.szafy","v":2200},"Szerokość",{"$f":"P20","v":1764},"Wysokość",{"$f":"Wys.szafy","v":2200},"Wysokość",{"$f":"Wys.uzyt.szafy","v":2019}]
{"$rows_left_out":7}
{"sheet":"QUANTUM","index":4,"n_rows":70,"n_cols":14,"rows_kept":70,"cut":false,"hidden":false,"merged":[[7,9,9,10],[7,11,9,12],[23,8,23,11],[16,8,16,11],[15,5,27,6],[35,1,35,5],[30,7,30,12],[31,7,31,12],[15,3,27,4],[15,1,27,2],[35,7,35,13],[34,7,34,13],[49,1,49,4],[53,1,53,4],[57,1,57,4],[37,1,37,4],[44,1,44,4],[42,1,42,5],[50,6,53,6],[50,7,53,7],[49,6,49,8],[50,8,53,8],[36,7,36,11],[36,12,36,13],[39,7,41,13]]}
[]
[]
[]
[]
[]
[]
[]
[]
[]
[]
[]
["1.",{"$f":"Opisy!A11","v":"Wybierz system:"}]
[]
["2.",{"$f":"Opisy!A115","v":"Opcje montażu:"},null,null,null,null,null,"3.",{"$f":"Opisy!A124","v":"Wybór zabudowy:"}]
[]
{"$rows_left_out":56}
{"sheet":"Quantum - obliczenia","index":5,"n_rows":51,"n_cols":12,"rows_kept":51,"cut":false,"hidden":true,"merged":[[40,4,40,7],[0,6,0,8],[0,9,0,10],[6,5,6,8],[10,5,10,8],[14,5,14,8]]}
[null,"Wybrany system",4,{"$f":"VLOOKUP(C1,A3:B7,2,FALSE)","v":"QUANTUM R + ARCO"},null,null,"Opcje montażu",null,null,"Wariant zabudowy"]
[null,null,null,null,null,null,1,2,3,4,5,1]
[1,"--Przejściowe bezramowe--","WO",{"$f":"QUANTUM!F31","v":2700},null,"SD",{"$f":"HLOOKUP($C$26,J2:K3,2,FALSE)","v":846},{"$f":"HLOOKUP($C$26,J2:K3,2,FALSE)","v":846},{"$f":"HLOOKUP($C$26,J2:K3,2,FALSE)","v":846},{"$f":"Szer.Otw.przej+Szer.zakl.przej","v":846},{"$f":"Szer.Otw.przej+Szer.zakl.przej*2","v":892},2]
[2,"QUANTUM","SO",{"$f":"QUANTUM!F32","v":800},null,"WD",{"$f":"Wys.otw.przej-56","v":2644},{"$f":"Wys.otw.przej-58","v":2642},{"$f":"Wys.otw.przej+20","v":2720},"-","-",3]
[3,"----Przejściowe ramowe----","X",{"$f":"QUANTUM!F33","v":46},null,"DT",{"$f":"HLOOKUP($C$26,$J$2:$K$5,4,FALSE)","v":1646},{"$f":"HLOOKUP($C$26,$J$2:$K$5,4,FALSE)","v":1646},{"$f":"HLOOKUP($C$26,$J$2:$K$5,4,FALSE)","v":1646},{"$f":"Szer.Otw.przej+J3","v":1646},{"$f":"Szer.Otw.przej+K3","v":1692},4]
[4,"QUANTUM R + ARCO",null,null,null,null,null,null,null,null,null,5]
[5,"QUANTUM R + FALDA",null,null,null,{"$f":"Opisy!C130","v":"Wymiary wypełnienia z płyty 10mm"},null,null,null,null,null,6]
[null,null,null,null,null,"SW10",{"$f":"G3-43","v":803},{"$f":"H3-43","v":803},803,null,null,7]
[null,"Opcje montażu",1,null,null,"WW10",{"$f":"G4-93","v":2551},{"$f":"H4-93","v":2549},2627,null,null,8]
[null,{"$f":"Opisy!A116","v":"Bezpośredni montaż do sufitu"},null,null,null,null,null,null,null,null,null,9]
[null,{"$f":"Opisy!A117","v":"Montaż do sufitu  - uchwyt górny"},null,null,null,{"$f":"Opisy!C131","v":"Wymiary wypełnienia ze szkła 4mm"},null,null,null,null,null,10]
[null,{"$f":"Opisy!A118","v":"Montaż do ściany - uchwyt boczny"},null,null,null,"SW4",{"$f":"G3-46","v":800},{"$f":"H3-46","v":800},800,null,null,11]
[null,null,null,null,null,"WW4",{"$f":"G4-94","v":2550},{"$f":"H4-94","v":2548},2626,null,null,12]
[null,"Grubość wypełnienia",5,null,null,null,null,null,null,null,null,13]
[1,{"$f":"B5","v":"----Przejściowe ramowe----"},null,null,null,{"$f":"Opisy!C132","v":"Wymiary profili aluminiowych"},null,null,null,null,null,14]
{"$rows_left_out":37}
{"sheet":"Opisy","index":6,"n_rows":474,"n_cols":9,"rows_kept":474,"cut":false,"hidden":true,"merged":[]}
["Wybór języka",1,null,null,{"$f":"Opisy!A48","v":"Błąd!"}]
[null,"Polski",null,null,{"$f":"Opisy!A49","v":"Niewłaściwy łącznik!"}]
[null,"English"]
[null,"Русский"]
[null,"Deutsch"]
[null,"Français"]
[null,{"$f":"Tabela1[[#Headers],[Українська]]","v":"Українська"}]
[null,"Lietuvos"]
[null,null,1,2,3,4,5,6,7]
["Tekst do wstawienia","Nr wiersza","PL","EN","RU","DE","FR","Українська","LT"]
[{"$f":"HLOOKUP($B$1,$C$9:$I$474,$B11,FALSE)","v":"Wybierz system:"},3,"Wybierz system:","Choose a system:","Выберите тип системы:","System auswählen:","Choix système:","Виберіть систему:","Pasirinkite sistema:"]
["Linia ERGO",4,"Linia ERGO","ERGO product line","Система ERGO","Linie ERGO","Ligne ERGO","Лінія ERGO","ERGO produktų linija"]
["Linia NOVO",5,"Linia NOVO","NOVO product line","Система NOVO","Linie NOVO","Ligne NOVO","Лінія NOVO","NOVO  produktų linija"]
["Wymiary otworu",6,"Wymiary otworu","Cavity inner dimensions","Размеры проема","Größe der Öffnung","Dimensions façade","Розмір отвору","Skylės matmenis "]
["<- MAX 2,74m",7,"<- MAX 2,74m","<- MAX 2,74m","<- MAX 2,74 м","<- MAX 2,74 m","<- MAX 2,74m","<- MAX 2,74м","<- MAX 2,74m"]
{"$rows_left_out":459}