{"text_format":"1","workbook":"xlsx","n_sheets":7,"sheets":["Dolny układ jezdny","Obliczenia-dolny","OVERLINE","Overline - Obliczenia","QUANTUM","Quantum - obliczenia","Opisy"],"not_rendered":{"charts":0,"images":44,"macros":1,"external_links":0,"defined_names":58,"comments":0,"pivot_tables":0},"unopened":[],"bounds":{"document_bytes":16777216,"sheet_cells":100000,"rows_first":2000,"rows_last":500,"rows_between":2000,"halvings":0,"cell_chars":16384,"cell_head_chars":4096},"cells_cut":0,"cells_raw":0,"read":"whole","date_system":"1900"}

{"sheet":"Dolny układ jezdny","index":0,"n_rows":70,"n_cols":13,"rows_kept":70,"cut":false,"hidden":false,"merged":[[6,3,6,4],[10,2,10,3],[16,2,16,3],[28,2,28,4],[28,5,28,12],[34,2,34,12],[9,10,11,10],[18,12,20,12],[18,11,20,11],[12,10,14,10],[9,11,11,11],[12,12,14,12],[18,10,20,10],[12,11,14,11],[15,10,17,10],[15,11,17,11],[15,12,17,12],[18,4,19,4],[21,2,26,4],[63,2,69,6],[56,2,56,4],[61,2,61,4],[62,2,62,4],[59,2,59,4],[60,2,60,6],[57,2,57,6],[58,2,58,4],[51,4,51,6],[52,8,53,8],[52,11,55,11],[56,11,58,11],[54,9,55,9],[52,10,55,10],[56,10,58,10],[52,9,53,9],[59,11,61,11],[52,12,55,12],[54,8,55,8],[55,2,55,4],[53,2,53,6],[54,2,54,6]]}
[]
[]
[]
[]
[]
[]
[null,null,{"$f":"Opisy!A11","v":"Wybierz system:"}]
[]
["1."]
[]
[null,null,{"$f":"Opisy!A14","v":"Wymiary otworu"},null,null,"SD",{"$f":"HLOOKUP('Obliczenia-dolny'!$B$44,'Obliczenia-dolny'!$L$1:$AI$46,5,FALSE)","v":1014.3333333333334},{"$f":"Opisy!$A$46","v":"mm"},{"$f":"Opisy!A51","v":"Szerokość drzwi"}]
["2.",null,{"$f":"Opisy!A18","v":"WO [mm]"},2700,{"$f":"IF(D12>2740,Opisy!A15,IF(D12<1000,Opisy!A16,Opisy!A17))","v":"<- OK"},"WD",{"$f":"HLOOKUP('Obliczenia-dolny'!$B$44,'Obliczenia-dolny'!$L$1:$AI$46,6,FALSE)","v":2660},{"$f":"Opisy!$A$46","v":"mm"},{"$f":"Opisy!A52","v":"Wysokość drzwi"}]
["3.",null,{"$f":"Opisy!A19","v":"SO [mm]"},3000,{"$f":"IF(AND('Obliczenia-dolny'!C44='Obliczenia-dolny'!B11,'Dolny układ jezdny'!D13>3000),Opisy!A76,IF(D13>6000,Opisy!A20,IF(D13<1000,Opisy!A16,Opisy!A17)))","v":"<- OK"},"SW18",{"$f":"HLOOKUP('Obliczenia-dolny'!$B$44,'Obliczenia-dolny'!$L$1:$AI$46,7,FALSE)","v":"-"},{"$f":"Opisy!$A$46","v":"mm"},{"$f":"Opisy!A53","v":"Szer. wyp. 18mm"}]
[null,null,null,null,null,"SW16",{"$f":"HLOOKUP('Obliczenia-dolny'!$B$44,'Obliczenia-dolny'!$L$1:$AI$46,8,FALSE)","v":"-"},{"$f":"Opisy!$A$46","v":"mm"},{"$f":"Opisy!A54","v":"Szer. wyp. 16mm"}]
[null,null,null,null,null,"SW12",{"$f":"HLOOKUP('Obliczenia-dolny'!$B$44,'Obliczenia-dolny'!$L$1:$AI$46,9,FALSE)","v":"-"},{"$f":"Opisy!$A$46","v":"mm"},{"$f":"Opisy!A55","v":"Szer. wyp. 12mm"}]
[null,null,null,null,null,"SW10",{"$f":"HLOOKUP('Obliczenia-dolny'!$B$44,'Obliczenia-dolny'!$L$1:$AI$46,10,FALSE)","v":987.33333333333337},{"$f":"Opisy!$A$46","v":"mm"},{"$f":"Opisy!A56","v":"Szer. wyp. 10mm"}]
[null,null,{"$f":"Opisy!A21","v":"Konfiguracja skrzydeł"},null,null,"SW4",{"$f":"HLOOKUP('Obliczenia-dolny'!$B$44,'Obliczenia-dolny'!$L$1:$AI$46,11,FALSE)","v":984.33333333333337},{"$f":"Opisy!$A$46","v":"mm"},{"$f":"Opisy!A57","v":"Szer. wyp. 4mm"}]
["4.",null,{"$f":"Opisy!A22","v":"n (l. skrzydeł)"},3,{"$f":"IF(D18=0,Opisy!A48,IF($D$18>$D$19,IF($D$18>$D$19+2,Opisy!A48,Opisy!A17),Opisy!A48))","v":"<- OK"},"WW18",{"$f":"HLOOKUP('Obliczenia-dolny'!$B$44,'Obliczenia-dolny'!$L$1:$AI$46,12,FALSE)","v":"-"},{"$f":"Opisy!$A$46","v":"mm"},{"$f":"Opisy!A58","v":"Wys. wyp. 18mm"}]
["5.",null,{"$f":"Opisy!A23","v":"k (l. zakładek)"},2,{"$f":"IF(D19=0,Opisy!A48,IF($D$18>$D$19,IF($D$18>$D$19+2,Opisy!A68,Opisy!A17),Opisy!A69))","v":"<- OK"},"WW16",{"$f":"HLOOKUP('Obliczenia-dolny'!$B$44,'Obliczenia-dolny'!$L$1:$AI$46,13,FALSE)","v":"-"},{"$f":"Opisy!$A$46","v":"mm"},{"$f":"Opisy!A59","v":"Wys. wyp. 16mm"}]
[null,null,{"$f":"Opisy!A24","v":"z (szer. zakładki)"},{"$f":"HLOOKUP('Obliczenia-dolny'!$B$44,'Obliczenia-dolny'!$L$1:$AI$46,21,FALSE)","v":23},null,"WW12",{"$f":"HLOOKUP('Obliczenia-dolny'!$B$44,'Obliczenia-dolny'!$L$1:$AI$46,14,FALSE)","v":"-"},{"$f":"Opisy!$A$46","v":"mm"},{"$f":"Opisy!A60","v":"Wys. wyp. 12mm"}]
[null,null,{"$f":"Opisy!A25","v":"Szczotka"},null,null,"WW10",{"$f":"HLOOKUP('Obliczenia-dolny'!$B$44,'Obliczenia-dolny'!$L$1:$AI$46,15,FALSE)","v":2600},{"$f":"Opisy!$A$46","v":"mm"},{"$f":"Opisy!A61","v":"Wys. wyp. 10mm"}]
[null,null,{"$f":"IF(D18-D19>1,Opisy!A73,\" \")","v":" "},null,null,"WW4",{"$f":"HLOOKUP('Obliczenia-dolny'!$B$44,'Obliczenia-dolny'!$L$1:$AI$46,16,FALSE)","v":2599},{"$f":"Opisy!$A$46","v":"mm"},{"$f":"Opisy!A62","v":"Wys. wyp. 4mm"}]
[null,null,null,null,null,"DR",{"$f":"HLOOKUP('Obliczenia-dolny'!$B$44,'Obliczenia-dolny'!$L$1:$AI$46,17,FALSE)","v":2660},{"$f":"Opisy!$A$46","v":"mm"},{"$f":"Opisy!A63","v":"Długość rączki"}]
[null,null,null,null,null,"DLP",{"$f":"HLOOKUP('Obliczenia-dolny'!$B$44,'Obliczenia-dolny'!$L$1:$AI$46,18,FALSE)","v":970.33333333333337},{"$f":"Opisy!$A$46","v":"mm"},{"$f":"Opisy!A64","v":"Dł. listew poz."}]
[null,null,null,null,null,{"$f":"IF(G25=Opisy!$E$1,Opisy!$E$2,\" \")","v":" "},{"$f":"IF(laczniki_tak,IF('Obliczenia-dolny'!$H$25=1,HLOOKUP(Wybrany_system,'Obliczenia-dolny'!$L$1:$AI$46,19,FALSE),IF(AND(System_z_grupy=\"B\",Wybrany_lacznik=1),HLOOKUP('Obliczenia-dolny'!$B$44,'Obliczenia-dolny'!$L$1:$AI$46,19,FALSE),Opisy!$A$48)),HLOOKUP('Obliczenia-dolny'!$B$44,'Obliczenia-dolny'!$L$1:$AI$46,19,FALSE))","v":18.830590000000001},{"$f":"Opisy!$A$67","v":"kg"},{"$f":"IF('Obliczenia-dolny'!$C$44='Obliczenia-dolny'!$B$11,Opisy!A74,Opisy!A65)","v":"Waga skrzydła z wypełnieniem z płyty"}]
[null,null,null,null,null,{"$f":"IF(G26=Opisy!$E$1,Opisy!$E$2,\" \")","v":" "},{"$f":"IF(laczniki_tak,IF('Obliczenia-dolny'!$H$25=1,HLOOKUP(Wybrany_system,'Obliczenia-dolny'!$L$1:$AI$46,20,FALSE),IF(AND(System_z_grupy=\"B\",Wybrany_lacznik=1),HLOOKUP('Obliczenia-dolny'!$B$44,'Obliczenia-dolny'!$L$1:$AI$46,20,FALSE),Opisy!$A$48)),HLOOKUP('Obliczenia-dolny'!$B$44,'Obliczenia-dolny'!$L$1:$AI$46,20,FALSE))","v":31.567538800000001},{"$f":"Opisy!$A$67","v":"kg"},{"$f":"IF('Obliczenia-dolny'!$C$44='Obliczenia-dolny'!$B$11,Opisy!A75,Opisy!A66)","v":"Waga skrzydła z wypełnieniem ze szkła"}]
[]
[null,null,{"$f":"Opisy!A26","v":"Uwaga:"}]
[null,null,{"$f":"Opisy!A27","v":"Proporcje skrzydeł dla montażu mechanizmu samodociągu:"},null,null,{"$f":"IF('Obliczenia-dolny'!$L$6/'Obliczenia-dolny'!$L$5>3,Opisy!A29,Opisy!A30)","v":"Proporcje są OK"}]
[null,null,{"$f":"Opisy!A28","v":"* - Waga skrzydła została wyliczona dla wypełnienia wykonanego z płyty wiórowej (620kg/m3) lub szkła zwykłego o grubości 4mm (2800kg/m3), bez łączeń."}]
[]
[null,null,null,null,"6.",{"$f":"Opisy!A31","v":"Łączniki"}]
[]
[]
[null,null,{"$f":"Opisy!A32","v":"Obliczenia wysokości wypełnień łączonych"}]
[]
[]
[]
[]
[]
[]
[]
[]
[]
[]
[]
[]
[]
[]
[]
[]
["7.",null,{"$f":"Opisy!A33","v":"Wybierz łącznik:"},null,{"$f":"IF(OR(F25=Opisy!E2,F26=Opisy!E2),Opisy!E2,\" \")","v":" "},null,null,null,{"$f":"IF(AND('Obliczenia-dolny'!$D$6,'Obliczenia-dolny'!$G$25='Obliczenia-dolny'!$D$25),\"↓18mm↓\",\" \")","v":" "},{"$f":"IF(AND('Obliczenia-dolny'!$D$6,'Obliczenia-dolny'!$G$25='Obliczenia-dolny'!D26),\"↓16/12+4mm↓\",\" \")","v":" "},{"$f":"IF(AND('Obliczenia-dolny'!$D$6,'Obliczenia-dolny'!$G$25='Obliczenia-dolny'!D27),\"↓18/4mm↓\",\" \")","v":" "},{"$f":"IF(AND('Obliczenia-dolny'!$D$6,'Obliczenia-dolny'!$G$25='Obliczenia-dolny'!D28),\"↓10/4mm↓\",\" \")","v":" "},{"$f":"IF(AND('Obliczenia-dolny'!$D$6,'Obliczenia-dolny'!$G$25='Obliczenia-dolny'!D29),\"↓FlatLine↓\",\" \")","v":" "}]
[]
[null,null,{"$f":"Opisy!A34","v":"Równomierne rozłożenie łączników."}]
[null,null,{"$f":"Opisy!A35","v":" Jedna grubość wypełnienia"}]
["8.",null,{"$f":"Opisy!A36","v":"i (ilość łączników)"},null,null,2,{"$f":"Opisy!$A$45","v":"szt."}]
[null,null,{"$f":"Opisy!A37","v":"Liczba elementów składowych"},null,null,{"$f":"IF('Obliczenia-dolny'!D6=TRUE,F56+1,\"-\")","v":"-"},{"$f":"Opisy!$A$45","v":"szt."}]
[null,null,{"$f":"Opisy!A38","v":"Elementy z płyty"}]
[null,null,{"$f":"Opisy!A39","v":"Wys. wyp. z płyty bez łączników"},null,null,{"$f":"'Obliczenia-dolny'!AK43","v":2600},{"$f":"Opisy!A46","v":"mm"}]
[null,null,{"$f":"Opisy!A40","v":"A (wys. elementów z płyty)"},null,null,{"$f":"'Obliczenia-dolny'!AK44","v":"-"},{"$f":"G59","v":"mm"}]
[null,null,{"$f":"Opisy!A42","v":"Elementy ze szkła 4mm"}]
[null,null,{"$f":"Opisy!A43","v":"Wys. wyp. 4mm bez łączników"},null,null,{"$f":"'Obliczenia-dolny'!AK45","v":2599},{"$f":"Opisy!A46","v":"mm"}]
[null,null,{"$f":"Opisy!A44","v":"C (wys. elementów ze szkła 4mm)"},null,null,{"$f":"'Obliczenia-dolny'!AK46","v":"-"},{"$f":"IF(AND('Obliczenia-dolny'!G25=\"C\",'Obliczenia-dolny'!D6),Opisy!A47,Opisy!A46)","v":"mm"}]
[null,null,{"$f":"IF(AND('Obliczenia-dolny'!G25=\"C\",'Obliczenia-dolny'!D6),Opisy!A50,\" \")","v":" "}]
[]
[]
[null,null,null,null,null,null,null,null,null,null,null,null,"GTV Poland Sp. z o.o. Sp. k."]
[null,null,null,null,null,null,null,null,null,null,null,null,"ul. Przejazdowa 21, 05-800 Pruszków, Polska"]
[null,null,null,null,null,null,null,null,null,null,null,null,"www.gtv.com.pl"]
[null,null,null,null,null,null,null,null,null,null,null,null,"gtv.tech@gtv.com.pl"]

{"sheet":"Obliczenia-dolny","index":1,"n_rows":46,"n_cols":37,"rows_kept":46,"cut":false,"hidden":true,"merged":[[29,11,29,34],[0,3,0,6],[4,3,4,6],[25,5,26,7],[1,5,2,5],[1,3,2,4],[23,36,27,36],[23,11,23,34],[24,11,24,34],[0,36,3,36],[1,12,1,14],[1,15,1,16],[1,22,1,23],[1,24,1,26],[1,27,1,28],[1,29,1,30],[25,11,25,34],[26,11,26,34],[27,11,27,34]]}
[1,"ERGO 18mm",null,"Wybór rozwiązania ze szczotką",null,null,null,null,{"$f":"L6/L5","v":2.6138224697019328},null,1,1,4,5,13,2,3,12,18,19,23,24,6,14,7,8,15,9,16,10,17,20,21,22,11,1,"Aktualnie wybrany system"]
[2,"NOVO II 18mm",null,true,null,{"$f":"IF(D2,3,0)","v":3},"Tak",null,null,"rączka",2,"ERGO","NOVO",null,null,"NOVO II",null,null,null,"NOVO 10","71 ARCO","85 FALDA","VISTA",null,"COTE",null,null,"NERO",null,"CARO",null,"FORM","TRAFO","FlatLine","Mito/Mito+",2]
[3,"NOVO II 12+4mm",null,null,null,null,"Nie",null,null,"system",3,"18mm","18mm","16mm","18/4mm","18mm","12+4mm","-","-","10/4mm","10/4mm",{"$f":"U3","v":"10/4mm"},"18mm","18/4mm","18mm","16mm","18/4mm","18mm","18/4mm","18mm","18/4mm","10/4mm","10/4mm","10/4mm","10/4mm",3]
[4,"NOVO S 18mm",null,null,null,null,null,null,null,"waga 1mb. [kg]",4,0.219,0.33800000000000002,0.33800000000000002,0.33800000000000002,0.33200000000000002,0.33200000000000002,"-","-",0.35,0.41799999999999998,0.46300000000000002,0.38,0.38,0.35699999999999998,0.35699999999999998,0.35699999999999998,0.39300000000000002,0.39300000000000002,0.41399999999999998,0.41399999999999998,0.36199999999999999,0.34100000000000003,0.40500000000000003,0,4]
[5,"NOVO S 16mm",null,"Łączniki",null,null,null,null,null,"SD",5,{"$f":"IF($D$2,('Dolny układ jezdny'!$D$13-3+'Dolny układ jezdny'!$D$19*L21)/'Dolny układ jezdny'!$D$18,('Dolny układ jezdny'!$D$13+'Dolny układ jezdny'!$D$19*L21)/'Dolny układ jezdny'!$D$18)","v":1017.6666666666666},{"$f":"IF($D$2,('Dolny układ jezdny'!$D$13-3+'Dolny układ jezdny'!$D$19*M21)/'Dolny układ jezdny'!$D$18,('Dolny układ jezdny'!$D$13+'Dolny układ jezdny'!$D$19*M21)/'Dolny układ jezdny'!$D$18)","v":1021.6666666666666},{"$f":"IF($D$2,('Dolny układ jezdny'!$D$13-3+'Dolny układ jezdny'!$D$19*N21)/'Dolny układ jezdny'!$D$18,('Dolny układ jezdny'!$D$13+'Dolny układ jezdny'!$D$19*N21)/'Dolny układ jezdny'!$D$18)","v":1021.6666666666666},{"$f":"IF($D$2,('Dolny układ jezdny'!$D$13-3+'Dolny układ jezdny'!$D$19*O21)/'Dolny układ jezdny'!$D$18,('Dolny układ jezdny'!$D$13+'Dolny układ jezdny'!$D$19*O21)/'Dolny układ jezdny'!$D$18)","v":1021.6666666666666},{"$f":"IF($D$2,('Dolny układ jezdny'!$D$13-3+'Dolny układ jezdny'!$D$19*P21)/'Dolny układ jezdny'!$D$18,('Dolny układ jezdny'!$D$13+'Dolny układ jezdny'!$D$19*P21)/'Dolny układ jezdny'!$D$18)","v":1021.6666666666666},{"$f":"IF($D$2,('Dolny układ jezdny'!$D$13-3+'Dolny układ jezdny'!$D$19*Q21)/'Dolny układ jezdny'!$D$18,('Dolny układ jezdny'!$D$13+'Dolny układ jezdny'!$D$19*Q21)/'Dolny układ jezdny'!$D$18)","v":1021.6666666666666},"-","-",{"$f":"IF($D$2,('Dolny układ jezdny'!$D$13-3+'Dolny układ jezdny'!$D$19*T21)/'Dolny układ jezdny'!$D$18,('Dolny układ jezdny'!$D$13+'Dolny układ jezdny'!$D$19*T21)/'Dolny układ jezdny'!$D$18)","v":1019},{"$f":"IF($D$2,('Dolny układ jezdny'!$D$13-3+'Dolny układ jezdny'!$D$19*U21)/'Dolny układ jezdny'!$D$18,('Dolny układ jezdny'!$D$13+'Dolny układ jezdny'!$D$19*U21)/'Dolny układ jezdny'!$D$18)","v":1020.3333333333334},{"$f":"IF($D$2,('Dolny układ jezdny'!$D$13-3+'Dolny układ jezdny'!$D$19*V21)/'Dolny układ jezdny'!$D$18,('Dolny układ jezdny'!$D$13+'Dolny układ jezdny'!$D$19*V21)/'Dolny układ jezdny'!$D$18)","v":1020.3333333333334},{"$f":"IF($D$2,('Dolny układ jezdny'!$D$13-3+'Dolny układ jezdny'!$D$19*W21)/'Dolny układ jezdny'!$D$18,('Dolny układ jezdny'!$D$13+'Dolny układ jezdny'!$D$19*W21)/'Dolny układ jezdny'!$D$18)","v":1019},{"$f":"IF($D$2,('Dolny układ jezdny'!$D$13-3+'Dolny układ jezdny'!$D$19*X21)/'Dolny układ jezdny'!$D$18,('Dolny układ jezdny'!$D$13+'Dolny układ jezdny'!$D$19*X21)/'Dolny układ jezdny'!$D$18)","v":1019},{"$f":"IF($D$2,('Dolny układ jezdny'!$D$13-3+'Dolny układ jezdny'!$D$19*Y21)/'Dolny układ jezdny'!$D$18,('Dolny układ jezdny'!$D$13+'Dolny układ jezdny'!$D$19*Y21)/'Dolny układ jezdny'!$D$18)","v":1018.3333333333334},{"$f":"IF($D$2,('Dolny układ jezdny'!$D$13-3+'Dolny układ jezdny'!$D$19*Z21)/'Dolny układ jezdny'!$D$18,('Dolny układ jezdny'!$D$13+'Dolny układ jezdny'!$D$19*Z21)/'Dolny układ jezdny'!$D$18)","v":1018.3333333333334},{"$f":"IF($D$2,('Dolny układ jezdny'!$D$13-3+'Dolny układ jezdny'!$D$19*AA21)/'Dolny układ jezdny'!$D$18,('Dolny układ jezdny'!$D$13+'Dolny układ jezdny'!$D$19*AA21)/'Dolny układ jezdny'!$D$18)","v":1018.3333333333334},{"$f":"IF($D$2,('Dolny układ jezdny'!$D$13-3+'Dolny układ jezdny'!$D$19*AB21)/'Dolny układ jezdny'!$D$18,('Dolny układ jezdny'!$D$13+'Dolny układ jezdny'!$D$19*AB21)/'Dolny układ jezdny'!$D$18)","v":1018.3333333333334},{"$f":"IF($D$2,('Dolny układ jezdny'!$D$13-3+'Dolny układ jezdny'!$D$19*AC21)/'Dolny układ jezdny'!$D$18,('Dolny układ jezdny'!$D$13+'Dolny układ jezdny'!$D$19*AC21)/'Dolny układ jezdny'!$D$18)","v":1018.3333333333334},{"$f":"IF($D$2,('Dolny układ jezdny'!$D$13-3+'Dolny układ jezdny'!$D$19*AD21)/'Dolny układ jezdny'!$D$18,('Dolny układ jezdny'!$D$13+'Dolny układ jezdny'!$D$19*AD21)/'Dolny układ jezdny'!$D$18)","v":1021.6666666666666},{"$f":"IF($D$2,('Dolny układ jezdny'!$D$13-3+'Dolny układ jezdny'!$D$19*AE21)/'Dolny układ jezdny'!$D$18,('Dolny układ jezdny'!$D$13+'Dolny układ jezdny'!$D$19*AE21)/'Dolny układ jezdny'!$D$18)","v":1021.6666666666666},{"$f":"IF($D$2,('Dolny układ jezdny'!$D$13-3+'Dolny układ jezdny'!$D$19*AF21)/'Dolny układ jezdny'!$D$18,('Dolny układ jezdny'!$D$13+'Dolny układ jezdny'!$D$19*AF21)/'Dolny układ jezdny'!$D$18)","v":1014.3333333333334},{"$f":"IF($D$2,('Dolny układ jezdny'!$D$13-3+'Dolny układ jezdny'!$D$19*AG21)/'Dolny układ jezdny'!$D$18,('Dolny układ jezdny'!$D$13+'Dolny układ jezdny'!$D$19*AG21)/'Dolny układ jezdny'!$D$18)","v":1019},{"$f":"IF($D$2,('Dolny układ jezdny'!$D$13-3+'Dolny układ jezdny'!$D$19*AH21)/'Dolny układ jezdny'!$D$18,('Dolny układ jezdny'!$D$13+'Dolny układ jezdny'!$D$19*AH21)/'Dolny układ jezdny'!$D$18)","v":1017.6666666666666},{"$f":"IF($D$2,('Dolny układ jezdny'!$D$13-3+'Dolny układ jezdny'!$D$19*AI21)/'Dolny układ jezdny'!$D$18,('Dolny układ jezdny'!$D$13+'Dolny układ jezdny'!$D$19*AI21)/'Dolny układ jezdny'!$D$18)","v":1019},5,{"$f":"'Dolny układ jezdny'!G11","v":1014.3333333333334}]
[6,"VISTA 18mm",null,false,null,"TAK/NIE",null,null,null,"WD",6,{"$f":"'Dolny układ jezdny'!$D$12-40","v":2660},{"$f":"'Dolny układ jezdny'!$D$12-40","v":2660},{"$f":"'Dolny układ jezdny'!$D$12-40","v":2660},{"$f":"'Dolny układ jezdny'!$D$12-40","v":2660},{"$f":"'Dolny układ jezdny'!$D$12-40","v":2660},{"$f":"'Dolny układ jezdny'!$D$12-40","v":2660},"-","-",{"$f":"'Dolny układ jezdny'!$D$12-40","v":2660},{"$f":"'Dolny układ jezdny'!$D$12-40","v":2660},{"$f":"'Dolny układ jezdny'!$D$12-40","v":2660},{"$f":"'Dolny układ jezdny'!$D$12-40","v":2660},{"$f":"'Dolny układ jezdny'!$D$12-40","v":2660},{"$f":"'Dolny układ jezdny'!$D$12-40","v":2660},{"$f":"'Dolny układ jezdny'!$D$12-40","v":2660},{"$f":"'Dolny układ jezdny'!$D$12-40","v":2660},{"$f":"'Dolny układ jezdny'!$D$12-40","v":2660},{"$f":"'Dolny układ jezdny'!$D$12-40","v":2660},{"$f":"'Dolny układ jezdny'!$D$12-40","v":2660},{"$f":"'Dolny układ jezdny'!$D$12-40","v":2660},{"$f":"'Dolny układ jezdny'!$D$12-40","v":2660},{"$f":"'Dolny układ jezdny'!$D$12-40","v":2660},{"$f":"'Dolny układ jezdny'!$D$12-40","v":2660},{"$f":"'Dolny układ jezdny'!$D$12-12","v":2688},6,{"$f":"'Dolny układ jezdny'!G12","v":2660}]
[7,"COTE 18mm",null,"Wybór łącznika",null,null,null,null,null,"SW18",7,{"$f":"L5-7","v":1010.6666666666666},{"$f":"M5-36","v":985.66666666666663},"-",{"$f":"O5-36","v":985.66666666666663},{"$f":"P5-30","v":991.66666666666663},"-","-","-","-","-","-",{"$f":"W5-31","v":988},{"$f":"X5-31","v":988},{"$f":"Y5-36","v":982.33333333333337},"-",{"$f":"AA5-36","v":982.33333333333337},{"$f":"AB5-31","v":987.33333333333337},{"$f":"AC5-31","v":987.33333333333337},{"$f":"AD5-31","v":990.66666666666663},{"$f":"AE5-31","v":990.66666666666663},"-","-","-",{"$f":"AI5","v":1019},7,{"$f":"'Dolny układ jezdny'!G13","v":"-"}]
[8,"COTE 16mm",null,null,8,"A-T18-300-XX",1,"A",null,"SW16",8,"-","-",{"$f":"N5-21","v":1000.6666666666666},"-","-","-","-","-","-","-","-","-","-","-",{"$f":"Z5-21","v":997.33333333333337},"-",{"$f":"W8","v":"-"},{"$f":"X8","v":"-"},"-","-","-","-","-",{"$f":"AI5","v":1019},8,{"$f":"'Dolny układ jezdny'!G14","v":"-"}]
[9,"NERO 18mm",null,null,null,"A-H18-300-XX",2,"A",null,"SW12",9,"-","-","-","-","-",{"$f":"Q5-7","v":1014.6666666666666},"-","-","-","-","-","-","-","-","-","-","-","-","-","-","-","-","-","-",9,{"$f":"'Dolny układ jezdny'!G15","v":"-"}]
[10,"CARO 18mm",null,null,null,"A-H16-300-XX",3,"B",null,"SW10",10,"-","-","-","-","-","-","-","-",{"$f":"T5-21","v":998},{"$f":"U5-43","v":977.33333333333337},{"$f":"V5-43","v":977.33333333333337},"-","-","-","-","-","-","-","-","-",{"$f":"AF5-27","v":987.33333333333337},{"$f":"AG5-21","v":998},{"$f":"AH5-36","v":981.66666666666663},"-",10,{"$f":"'Dolny układ jezdny'!G16","v":987.33333333333337}]
[11,"MITO/MITO PLUS",null,"-",null,"A-HRS18-YYY-XX",4,"C",null,"SW4",11,"-","-","-",{"$f":"O5-24","v":997.66666666666663},"-",{"$f":"Q5-32","v":989.66666666666663},"-","-",{"$f":"T5-24","v":995},{"$f":"U10-3","v":974.33333333333337},{"$f":"V10-3","v":974.33333333333337},"-",{"$f":"X5-23","v":996},"-","-",{"$f":"AA5-23","v":995.33333333333337},"-",{"$f":"AC5-23","v":995.33333333333337},"-",{"$f":"AE5-23","v":998.66666666666663},{"$f":"AF5-30","v":984.33333333333337},{"$f":"AG5-24","v":995},{"$f":"AH5-39","v":978.66666666666663},"-",11,{"$f":"'Dolny układ jezdny'!G17","v":984.33333333333337}]
[12,{"$f":"Opisy!A71","v":"------RAMOWE 18mm--------------"},null,"-",null,"A-HR18-300-XX",5,"C",null,"WW18",12,{"$f":"L6-3","v":2657},{"$f":"M6-3","v":2657},"-",{"$f":"O6-69","v":2591},{"$f":"P6-3","v":2657},"-","-","-","-","-","-",{"$f":"M12","v":2657},{"$f":"O12","v":2591},{"$f":"W12","v":2657},"-",{"$f":"X12","v":2591},2657,2591,{"$f":"W12","v":2657},{"$f":"X12","v":2591},"-","-","-",{"$f":"AI6","v":2688},12,{"$f":"'Dolny układ jezdny'!G18","v":"-"}]
[13,"NOVO S 18/4mm",null,"-",null,"A-HRS10-YYY-XX",6,"D",null,"WW16",13,"-","-",{"$f":"N6-3","v":2657},"-","-","-","-","-","-","-","-","-","-","-",{"$f":"N13","v":2657},"-","-","-","-","-","-","-","-",{"$f":"AI6","v":2688},13,{"$f":"'Dolny układ jezdny'!G19","v":"-"}]
[14,"VISTA 18/4mm",null,null,null,"A-HR10-YYY-XX",7,"D",null,"WW12",14,"-","-","-","-","-",{"$f":"Q6-3","v":2657},"-","-","-","-","-","-","-","-","-","-","-","-","-","-","-","-","-","-",14,{"$f":"'Dolny układ jezdny'!G20","v":"-"}]
[15,"COTE 18/4mm",null,null,null,"A-HR10FL-YYY-XX",8,"E",null,"WW10",15,"-","-","-","-","-","-","-","-",{"$f":"T6-60","v":2600},{"$f":"T15","v":2600},{"$f":"U15","v":2600},"-","-","-","-","-","-","-","-","-",{"$f":"AF6-60","v":2600},{"$f":"AG6-60","v":2600},{"$f":"AH6-5","v":2655},"-",15,{"$f":"'Dolny układ jezdny'!G21","v":2600}]
[16,"NERO 18/4mm",null,null,null,null,null,null,null,"WW4",16,"-","-","-",{"$f":"O6-61","v":2599},"-",{"$f":"Q6-5","v":2655},"-","-",{"$f":"T6-61","v":2599},{"$f":"T16","v":2599},{"$f":"U16","v":2599},"-",{"$f":"O16","v":2599},"-","-",{"$f":"X16","v":2599},"-",2599,"-",2599,{"$f":"AF6-61","v":2599},{"$f":"AG6-61","v":2599},{"$f":"AH6-6","v":2654},"-",16,{"$f":"'Dolny układ jezdny'!G22","v":2599}]
[17,"CARO 18/4mm",null,null,null,null,null,null,null,"DR",17,{"$f":"L6","v":2660},2660,2660,2660,2660,2660,"-","-",2660,2660,2660,2660,2660,2660,2660,2660,2660,2660,2660,2660,{"$f":"AF6","v":2660},2660,2660,"-",17,{"$f":"'Dolny układ jezdny'!G23","v":2660}]
[18,{"$f":"Opisy!A72","v":"------RAMOWE 10mm--------------"},null,null,null,null,null,null,null,"DLP",18,{"$f":"L5-53","v":964.66666666666663},{"$f":"M5-52","v":969.66666666666663},{"$f":"N5-52","v":969.66666666666663},{"$f":"O5-52","v":969.66666666666663},{"$f":"P5-52","v":969.66666666666663},{"$f":"Q5-52","v":969.66666666666663},"-","-",{"$f":"T5-38","v":981},{"$f":"U10-17","v":960.33333333333337},{"$f":"V10-17","v":960.33333333333337},{"$f":"W5-55","v":964},{"$f":"X5-55","v":964},{"$f":"Y5-52","v":966.33333333333337},{"$f":"Z5-52","v":966.33333333333337},966.33333333333337,{"$f":"AB5-55","v":963.33333333333337},963.33333333333337,966.66666666666663,{"$f":"AE5-55","v":966.66666666666663},{"$f":"AF5-44","v":970.33333333333337},{"$f":"AG5-38","v":981},{"$f":"AH5-53","v":964.66666666666663},"-",18,{"$f":"'Dolny układ jezdny'!G24","v":970.33333333333337}]
[19,"NOVO 10/4mm",null,null,null,null,null,null,null,"Skrzydło na płycie [kg]",19,{"$f":"L22+SUM(L29:L41)","v":31.668867946666662},{"$f":"M22+SUM(M29:M41)","v":31.561864946666663},{"$f":"N22+SUM(N29:N41)","v":28.709770293333332},{"$f":"O22+SUM(O29:O41)","v":31.376936306666664},{"$f":"P22+SUM(P29:P41)","v":31.707857666666662},"-","-","-",{"$f":"T22+SUM(T29:T41)","v":18.946269999999998},18.960210000000004,19.199610000000003,31.853110560000001,31.663301279999999,31.563291213333336,32.008073013333338,30.603958440000003,{"$f":"AB22+SUM(AB29:AB41)","v":31.902339813333338},{"$f":"AC22+SUM(AC29:AC41)","v":31.712649573333337},32.113713546666666,31.923428106666663,{"$f":"AF22+SUM(AF29:AF41)","v":18.830590000000001},18.898389999999999,19.330562333333333,{"$f":"AI22+SUM(AI29:AI41)","v":30.968043519999998},19,{"$f":"'Dolny układ jezdny'!G25","v":18.830590000000001}]
[20,"FORM 10/4mm",null,null,null,null,null,null,null,"Skrzydło na szkle [kg]",20,"-","-","-",{"$f":"O23+SUM(O29:O41)","v":31.916712133333331},"-",{"$f":"Q22+Q23+SUM(Q29:Q41)","v":51.789578506666665},"-","-",{"$f":"T23+SUM(T29:T41)","v":31.821766},{"$f":"U23+SUM(U29:U41)","v":31.567270800000003},{"$f":"V23+SUM(V29:V41)","v":31.806670800000003},"-",{"$f":"X23+SUM(X29:X41)","v":32.087092800000001},"-","-",{"$f":"AA23+SUM(AA29:AA41)","v":31.172198933333334},"-",{"$f":"AC23+SUM(AC29:AC41)","v":32.136312266666671},"-",{"$f":"AE23+SUM(AE29:AE41)","v":32.347734933333328},{"$f":"AF23+SUM(AF29:AF41)","v":31.567538800000001},{"$f":"AG23+SUM(AG29:AG41)","v":31.773886000000001},{"$f":"AH23+SUM(AH29:AH41)","v":32.262018266666658},{"$f":"AI23+SUM(AI29:AI41)","v":27.57159424},20,{"$f":"'Dolny układ jezdny'!G26","v":31.567538800000001}]
[21,"TRAFO 10/4mm",null,null,null,null,null,null,null,"Szerokość zakładki",21,28,34,34,34,34,34,"-","-",30,32,32,30,30,29,29,29,29,29,34,34,23,30,28,30,21,{"$f":"HLOOKUP($B$44,$L$1:$AI$46,AJ21,FALSE)","v":23}]
[22,"FLAT LINE 10/4mm",null,null,null,null,null,null,null,"Waga wypełnienia z płyty",22,{"$f":"L7*L12*18*$L$25/1000000000","v":29.968409279999996},{"$f":"M7*M12*18*$L$25/1000000000","v":29.227106279999997},{"$f":"N8*N13*16*$L$25/1000000000","v":26.375011626666666},{"$f":"O7*O12*18*$L$25/1000000000","v":28.501103639999997},{"$f":"P7*P12*18*$L$25/1000000000","v":29.405018999999996},{"$f":"Q9*Q14*12*$L$25/1000000000","v":20.058011839999995},"-","-",{"$f":"T10*T15*10*$L$25/1000000000","v":16.087759999999999},{"$f":"U10*U15*10*$L$25/1000000000","v":15.754613333333335},{"$f":"V10*V15*10*$L$25/1000000000","v":15.754613333333335},{"$f":"W7*W12*18*$L$25/1000000000","v":29.29629456},{"$f":"X7*X12*18*$L$25/1000000000","v":28.568573279999999},{"$f":"Y7*Y12*18*$L$25/1000000000","v":29.128265880000004},{"$f":"Z8*Z13*18*$L$25/1000000000","v":29.573047680000005},{"$f":"AA7*AA12*18*$L$25/1000000000","v":28.404718440000003},{"$f":"AB7*AB12*18*$L$25/1000000000","v":29.276526480000005},{"$f":"AC7*AC12*18*$L$25/1000000000","v":28.549296240000004},{"$f":"AD7*AD12*18*$L$25/1000000000","v":29.375366879999998},{"$f":"AE7*AE12*18*$L$25/1000000000","v":28.645681439999997},{"$f":"AF10*AF15*10*$L$25/1000000000","v":15.915813333333336},{"$f":"AG10*AG15*10*$L$25/1000000000","v":16.087759999999999},{"$f":"AH10*AH15*10*$L$25/1000000000","v":16.159215},{"$f":"AI7*AI12*18*$L$25/1000000000","v":30.56804352},22,{"$f":"HLOOKUP($B$44,$L$1:$AI$46,AJ22,FALSE)","v":15.915813333333336}]
[23,"ARCO 10/4mm",null,"Warunek poprawnego wyboru łącznika",null,null,null,null,null,"Waga wypełnienia ze szkła",23,"-","-","-",{"$f":"O11*O16*4*$L$27/1000000000","v":29.040879466666663},"-",{"$f":"Q11*Q16*4*$L$27/1000000000","v":29.428728},"-","-",{"$f":"T11*T16*4*$L$27/1000000000","v":28.963256000000001},{"$f":"U11*U16*4*$L$27/1000000000","v":28.361674133333334},{"$f":"V11*V16*4*$L$27/1000000000","v":28.361674133333334},"-",{"$f":"X11*X16*4*$L$27/1000000000","v":28.992364800000001},"-","-",{"$f":"AA11*AA16*4*$L$27/1000000000","v":28.972958933333334},"-",{"$f":"AC11*AC16*4*$L$27/1000000000","v":28.972958933333334},"-",{"$f":"AE11*AE16*4*$L$27/1000000000","v":29.069988266666662},{"$f":"AF11*AF16*4*$L$27/1000000000","v":28.652762133333336},{"$f":"AG11*AG16*4*$L$27/1000000000","v":28.963256000000001},{"$f":"AH11*AH16*4*$L$27/1000000000","v":29.090670933333328},{"$f":"AI8*AI13*16*$L$25/1000000000","v":27.171594240000001},23,{"$f":"HLOOKUP($B$44,$L$1:$AI$46,AJ23,FALSE)","v":28.652762133333336}]
[24,"FALDA 10/4mm",null,"Grupy łączników",null,"Łącznik z grupy:","System z grupy:","Test",null,null,24,"Płyta wiórowa - wga 1m3 [kg]",null,null,null,null,null,null,null,null,null,null,null,null,null,null,null,null,null,null,null,null,null,null,null,24]
[null,null,null,"A","18mm",{"$f":"VLOOKUP(E8,G8:H15,2,FALSE)","v":"E"},{"$f":"HLOOKUP(B44,$L$1:$AI$42,42,FALSE)","v":"D"},{"$f":"IF(F25=G25,1,IF(AND(Lacznik_z_grupy=D29,System_z_grupy=T42),1,0))","v":1},null,null,25,620,null,null,null,null,null,null,null,null,null,null,null,null,null,null,null,null,null,null,null,null,null,null,null,25]
[null,null,null,"B","16 (12+4)mm",null,null,null,null,null,26,"Szkło 4mm - waga 1m3 [kg]",null,null,null,null,null,null,null,null,null,null,null,null,null,null,null,null,null,null,null,null,null,null,null,26]
[null,null,null,"C","18/4mm",null,null,null,null,null,27,2800,null,null,null,null,null,null,null,null,null,null,null,null,null,null,null,null,null,null,null,null,null,null,null,27]
[null,null,null,"D","10/4mm","LICZBA ŁĄCZNIKÓW",{"$f":"'Dolny układ jezdny'!F56","v":2},null,null,null,28,"Okucia - waga 1 kpl.",null,null,null,null,null,null,null,null,null,null,null,null,null,null,null,null,null,null,null,null,null,null,null,28]
[null,null,null,"E","FlatLine",null,null,null,null,null,29,0.3,0.3,0.3,0.3,0.3,0.3,"-","-",0.3,0.3,0.3,0.3,0.3,0.3,0.3,0.3,0.3,0.3,0.3,0.3,0.3,0.3,0.3,0.4,29,{"$f":"HLOOKUP($B$44,$L$1:$AI$46,AJ29,FALSE)","v":0.3}]
[null,null,null,null,null,null,null,null,null,null,30,"Aluminium",null,null,null,null,null,null,null,null,null,null,null,null,null,null,null,null,null,null,null,null,null,null,null,30]
[null,null,null,null,null,null,null,null,"LG18",0.25700000000000001,31,"-","-","-",{"$f":"J31*$O$18/1000","v":0.24920433333333333},"-","-","-","-","-","-","-","-",{"$f":"X18*$J$31/1000","v":0.24774800000000002},"-","-","-","-",{"$f":"AC18*$J$31/1000","v":0.24757666666666669},"-",{"$f":"AE18*$J$31/1000","v":0.24843333333333334},"-","-","-","-",31,{"$f":"HLOOKUP($B$44,$L$1:$AI$46,AJ31,FALSE)","v":"-"}]
[null,null,null,null,null,null,null,null,"LD18",0.54500000000000004,32,"-","-","-",{"$f":"J32*$O$18/1000","v":0.52846833333333332},"-","-","-","-","-","-","-","-",{"$f":"X18*$J$32/1000","v":0.52537999999999996},"-","-","-","-",{"$f":"AC18*$J$32/1000","v":0.5250166666666668},"-",{"$f":"AE18*$J$32/1000","v":0.52683333333333338},"-","-","-","-",32,{"$f":"HLOOKUP($B$44,$L$1:$AI$46,AJ32,FALSE)","v":"-"}]
[null,null,null,null,null,null,null,null,"LG10",0.23599999999999999,33,"-","-","-","-","-","-","-","-",{"$f":"T18*$J$33/1000","v":0.231516},{"$f":"U18*$J$33/1000","v":0.22663866666666665},{"$f":"V18*$J$33/1000","v":0.22663866666666665},"-","-","-","-","-","-","-","-","-",{"$f":"AF18*$J$33/1000","v":0.22899866666666666},{"$f":"AG18*$J$33/1000","v":0.231516},{"$f":"AH18*0.249/1000","v":0.240202},"-",33,0.22899866666666666]
[null,null,null,null,null,null,null,null,"LD10",0.47399999999999998,34,"-","-","-","-","-","-","-","-",{"$f":"T18*$J$34/1000","v":0.46499399999999996},{"$f":"U18*$J$34/1000","v":0.45519799999999999},{"$f":"V18*$J$34/1000","v":0.45519799999999999},"-","-","-","-","-","-","-","-","-",{"$f":"AF18*$J$34/1000","v":0.45993800000000001},{"$f":"AG18*$J$34/1000","v":0.46499399999999996},{"$f":"AH18*0.494/1000","v":0.47654533333333332},"-",34,0.45993800000000001]
[null,null,null,null,null,null,null,null,"HRS10",0.26800000000000002,35,"-","-","-","-","-","-","-","-",{"$f":"IF(AND($D$6,$E$8=6),$J$35*$G$28*T18/1000,0)","v":0},{"$f":"IF(AND($D$6,$E$8=6),$J$35*$G$28*U18/1000,0)","v":0},{"$f":"IF(AND($D$6,$E$8=6),$J$35*$G$28*V18/1000,0)","v":0},"-","-","-","-","-","-","-","-","-",{"$f":"IF(AND($D$6,$E$8=6),$J$35*$G$28*AF18/1000,0)","v":0},{"$f":"IF(AND($D$6,$E$8=6),$J$35*$G$28*AG18/1000,0)","v":0},"-","-",35,0]
[null,null,null,null,null,null,null,null,"HR10 lub HR10FL",0.185,36,"-","-","-","-","-","-","-","-",{"$f":"IF(AND($D$6,$E$8=7),$J$36*$G$28*T18/1000,IF(AND(laczniki_tak,Wybrany_lacznik=$G$15),0.75*$J$36*T18*l._lacznikow/1000,0))","v":0},{"$f":"IF(AND($D$6,$E$8=7),$J$36*$G$28*U18/1000,IF(AND(laczniki_tak,Wybrany_lacznik=$G$15),0.75*$J$36*U18*l._lacznikow/1000,0))","v":0},{"$f":"IF(AND($D$6,$E$8=7),$J$36*$G$28*V18/1000,IF(AND(laczniki_tak,Wybrany_lacznik=$G$15),0.75*$J$36*V18*l._lacznikow/1000,0))","v":0},"-","-","-","-","-","-","-","-","-",{"$f":"IF(AND($D$6,$E$8=7),$J$36*$G$28*AF18/1000,IF(AND(laczniki_tak,Wybrany_lacznik=$G$15),0.75*$J$36*AF18*l._lacznikow/1000,0))","v":0},{"$f":"IF(AND($D$6,$E$8=7),$J$36*$G$28*AG18/1000,IF(AND(laczniki_tak,Wybrany_lacznik=$G$15),0.75*$J$36*AG18*l._lacznikow/1000,0))","v":0},{"$f":"IF(AND($D$6,$E$8=8),0.75*$J$36*$G$28*AH18/1000,0)","v":0},"-",36,0]
[null,null,null,null,null,null,null,null,"C",0.122,37,{"$f":"2*$J$37*L18/1000","v":0.23537866666666665},{"$f":"2*$J$37*M18/1000","v":0.23659866666666665},{"$f":"2*$J$37*N18/1000","v":0.23659866666666665},"-",{"$f":"2*$J$37*P18/1000","v":0.23659866666666665},{"$f":"2*$J$37*Q18/1000","v":0.23659866666666665},"-","-","-","-","-",{"$f":"2*$J$37*W18/1000","v":0.23521600000000001},"-",{"$f":"2*$J$37*Y18/1000","v":0.23578533333333335},{"$f":"2*$J$37*Z18/1000","v":0.23578533333333335},"-",{"$f":"2*$J$37*AB18/1000","v":0.23505333333333334},"-",{"$f":"2*$J$37*AD18/1000","v":0.23586666666666664},"-","-","-","-","-",37,"-"]
[null,null,null,null,null,null,null,null,"łącznik HRS18",0.34799999999999998,38,"-","-","-",{"$f":"IF(AND($D$6,$E$8=4),$J$38*$G$28*O18/1000,0)","v":0},"-","-","-","-","-","-","-","-",{"$f":"IF(AND($D$6,$E$8=4),$J$38*$G$28*X18/1000,0)","v":0},"-","-",{"$f":"IF(AND($D$6,$E$8=4),$J$38*$G$28*AA18/1000,0)","v":0},"-",{"$f":"IF(AND($D$6,$E$8=4),$J$38*$G$28*AC18/1000,0)","v":0},"-",{"$f":"IF(AND($D$6,$E$8=4),$J$38*$G$28*AE18/1000,0)","v":0},"-","-","-","-",38,"-"]
[null,null,null,null,null,null,null,null,"łącznik HR18",0.20899999999999999,39,"-","-","-",{"$f":"IF(AND($D$6,$E$8=5),$J$39*$G$28*O18/1000,0)","v":0},"-","-","-","-","-","-","-","-",{"$f":"IF(AND($D$6,$E$8=5),$J$39*$G$28*X18/1000,0)","v":0},"-","-",{"$f":"IF(AND($D$6,$E$8=5),$J$39*$G$28*AA18/1000,0)","v":0},"-",{"$f":"IF(AND($D$6,$E$8=5),$J$39*$G$28*AC18/1000,0)","v":0},"-",{"$f":"IF(AND($D$6,$E$8=5),$J$39*$G$28*AE18/1000,0)","v":0},"-","-","-","-",39,"-"]
[null,null,null,null,null,null,null,null,"łącznik H18",0.112,40,{"$f":"IF(AND($D$6,$E$8<3),$J$40*$G$28*L18/1000,0)","v":0},{"$f":"IF(AND($D$6,$E$8<3),$J$40*$G$28*M18/1000,0)","v":0},{"$f":"IF(AND($D$6,OR($E$8=3,$E$8=1)),$J$40*$G$28*N18/1000,0)","v":0},null,{"$f":"IF(AND($D$6,$E$8<3),$J$40*$G$28*P18/1000,0)","v":0},{"$f":"IF(AND($D$6,OR($E$8=3,$E$8=1)),$J$40*$G$28*Q18/1000,0)","v":0},"-","-",null,null,null,{"$f":"IF(AND($D$6,$E$8<3),$J$40*$G$28*W18/1000,0)","v":0},null,{"$f":"IF(AND($D$6,$E$8<3),$J$40*$G$28*Y18/1000,0)","v":0},{"$f":"IF(AND($D$6,OR($E$8=3,$E$8=1)),$J$40*$G$28*Z18/1000,0)","v":0},null,{"$f":"IF(AND($D$6,$E$8<3),$J$40*$G$28*AB18/1000,0)","v":0},null,{"$f":"IF(AND($D$6,$E$8<3),$J$40*$G$28*AD18/1000,0)","v":0},null,null,null,"-","-",40,0]
[null,null,null,null,null,null,null,null,"Rączka",null,41,{"$f":"2*L4*L17/1000","v":1.1650799999999999},{"$f":"2*M4*M17/1000","v":1.79816},1.79816,1.79816,1.76624,1.76624,"-","-",1.8619999999999999,2.22376,2.4631600000000002,2.0216000000000003,2.0216000000000003,1.89924,1.89924,1.89924,{"$f":"2*AB4*AB17/1000","v":2.0907600000000004},2.0907600000000004,2.20248,2.20248,1.92584,1.8141200000000002,2.1546000000000003,"-",41,1.92584]
[null,null,null,null,null,null,null,null,"System należy do grupy łączników",null,42,"A","A","B","C","A","B","-","-","D","D","D","A","C","A","B","C","A","C","A","C","D","D","E","F",42,"D"]
[null,null,null,null,null,null,null,null,"Wys. wyp. z płyty bez łączników",null,43,{"$f":"L12","v":2657},{"$f":"M12","v":2657},{"$f":"N13","v":2657},{"$f":"O12","v":2591},{"$f":"P12","v":2657},{"$f":"Q14","v":2657},"-","-",{"$f":"T15","v":2600},{"$f":"U15","v":2600},{"$f":"V15","v":2600},{"$f":"W12","v":2657},{"$f":"X12","v":2591},{"$f":"Y12","v":2657},{"$f":"Z13","v":2657},{"$f":"AA12","v":2591},{"$f":"AB12","v":2657},2591,2657,2591,{"$f":"AF15","v":2600},{"$f":"AG15","v":2600},{"$f":"AH15","v":2655},"-",43,2600]
["Wyb. Syst.",20,{"$f":"VLOOKUP(B44,A1:B24,2,FALSE)","v":"FORM 10/4mm"},null,null,null,null,null,"Wys. wyp. łączonych (płyta)",null,44,{"$f":"IF(AND($D$6,$F$25=L42,$G$25=L42),(L12-$G$28)/($G$28+1),$D$11)","v":"-"},{"$f":"IF(AND($D$6,$F$25=M42,$G$25=M42),(M12-$G$28)/($G$28+1),$D$11)","v":"-"},{"$f":"IF(OR(AND($D$6,$F$25=N42,$G$25=N42),(AND(laczniki_tak,Wybrany_lacznik=1,System_z_grupy=N42))),(N43-$G$28)/($G$28+1),$D$11)","v":"-"},{"$f":"IF(AND($D$6,$F$25=O42,$G$25=O42),IF($E$8=4,(O43-$G$28*19)/($G$28+1),(O43-$G$28*9)/($G$28+1)),$D$11)","v":"-"},{"$f":"IF(AND($D$6,$F$25=P42,$G$25=P42),(P43-$G$28)/($G$28+1),$D$11)","v":"-"},{"$f":"N44","v":"-"},"-","-",{"$f":"IF(AND($D$6,OR(AND($F$25=T42,$G$25=T42),AND(System_z_grupy=$D$28,Lacznik_z_grupy=$D$29))),IF($E$8=6,(T43-$G$28*7.5)/($G$28+1),(T43-$G$28)/(1+$G$28)),$D$11)","v":"-"},{"$f":"IF(AND($D$6,OR(AND($F$25=U42,$G$25=U42),AND(System_z_grupy=$D$28,Lacznik_z_grupy=$D$29))),IF($E$8=6,(U43-$G$28*7.5)/($G$28+1),(U43-$G$28)/(1+$G$28)),$D$11)","v":"-"},{"$f":"IF(AND($D$6,OR(AND($F$25=V42,$G$25=V42),AND(System_z_grupy=$D$28,Lacznik_z_grupy=$D$29))),IF($E$8=6,(V43-$G$28*7.5)/($G$28+1),(V43-$G$28)/(1+$G$28)),$D$11)","v":"-"},{"$f":"IF(AND($D$6,$F$25=W42,$G$25=W42),(W43-$G$28)/($G$28+1),$D$11)","v":"-"},{"$f":"O44","v":"-"},{"$f":"IF(AND($D$6,$F$25=Y42,$G$25=Y42),(Y43-$G$28)/($G$28+1),$D$11)","v":"-"},{"$f":"N44","v":"-"},{"$f":"O44","v":"-"},{"$f":"IF(AND($D$6,$F$25=AB42,$G$25=AB42),(AB12-$G$28)/($G$28+1),$D$11)","v":"-"},{"$f":"IF(AND($D$6,$F$25=AC42,$G$25=AC42),IF($E$8=4,(AC43-$G$28*19)/($G$28+1),(AC43-$G$28*9)/($G$28+1)),$D$11)","v":"-"},{"$f":"IF(AND($D$6,$F$25=AD42,$G$25=AD42),(AD12-$G$28)/($G$28+1),$D$11)","v":"-"},{"$f":"IF(AND($D$6,$F$25=AE42,$G$25=AE42),IF($E$8=4,(AE43-$G$28*19)/($G$28+1),(AE43-$G$28*9)/($G$28+1)),$D$11)","v":"-"},{"$f":"V44","v":"-"},{"$f":"V44","v":"-"},{"$f":"IF(AND(laczniki_tak,H25=1,Wybrany_lacznik=G15),(AH43-l._lacznikow*1)/(l._lacznikow+1),D11)","v":"-"},"-",44,"-"]
[null,null,null,null,null,null,null,null,"Wys. wyp. 4mm bez łączników",null,45,"-","-","-",{"$f":"O16","v":2599},"-",2655,"-","-",2599,2599,2599,"-",2599,"-","-",{"$f":"AA16","v":2599},{"$f":"AB16","v":"-"},2599,"-",2599,2599,2599,{"$f":"AH16","v":2654},"-",45,2599]
[null,null,null,null,null,null,null,null,"Wys. wyp. łączonych (szkło)",null,46,"-","-","-",{"$f":"IF(AND($D$6,$F$25=O42,$G$25=O42),IF($E$8=4,(O45-$G$28*11)/($G$28+1),(O45-$G$28)/($G$28+1)),$D$11)","v":"-"},"-",{"$f":"IF(Q44=D11,D11,Q44-1)","v":"-"},"-","-",{"$f":"IF(AND($D$6,OR(AND($F$25=T42,$G$25=T42),AND(System_z_grupy=$D$28,Lacznik_z_grupy=$D$29))),IF($E$8=6,(T45-$G$28*10)/($G$28+1),(T45-$G$28*4)/(1+$G$28)),$D$11)","v":"-"},{"$f":"IF(AND($D$6,OR(AND($F$25=U42,$G$25=U42),AND(System_z_grupy=$D$28,Lacznik_z_grupy=$D$29))),IF($E$8=6,(U45-$G$28*10)/($G$28+1),(U45-$G$28*4)/(1+$G$28)),$D$11)","v":"-"},{"$f":"IF(AND($D$6,OR(AND($F$25=V42,$G$25=V42),AND(System_z_grupy=$D$28,Lacznik_z_grupy=$D$29))),IF($E$8=6,(V45-$G$28*10)/($G$28+1),(V45-$G$28*4)/(1+$G$28)),$D$11)","v":"-"},"-",{"$f":"O46","v":"-"},"-","-",{"$f":"O46","v":"-"},"-",{"$f":"IF(AND($D$6,$F$25=AC42,$G$25=AC42),IF($E$8=4,(AC45-$G$28*11)/($G$28+1),(AC45-$G$28)/($G$28+1)),$D$11)","v":"-"},"-",{"$f":"IF(AND($D$6,$F$25=AE42,$G$25=AE42),IF($E$8=4,(AE45-$G$28*11)/($G$28+1),(AE45-$G$28)/($G$28+1)),$D$11)","v":"-"},{"$f":"V46","v":"-"},{"$f":"V46","v":"-"},{"$f":"IF(AND(laczniki_tak,H25=1,Wybrany_lacznik=G15),(AH45-l._lacznikow*4)/(l._lacznikow+1),D11)","v":"-"},"-",46,"-"]

{"sheet":"OVERLINE","index":2,"n_rows":70,"n_cols":13,"rows_kept":70,"cut":false,"hidden":false,"merged":[[44,2,45,9],[30,10,31,11],[30,12,31,12],[44,10,45,11],[44,12,45,12],[34,7,34,12],[30,2,31,9],[26,9,26,10],[26,11,26,12],[40,5,40,6],[40,7,40,8],[40,9,40,10],[40,11,40,12],[26,5,26,6],[26,7,26,8],[35,5,35,12],[36,5,36,6],[36,7,36,8],[36,9,36,10],[36,11,36,12],[17,1,17,3],[18,1,18,3],[21,5,21,12],[22,9,22,10],[22,11,22,12],[22,5,22,6],[22,7,22,8],[20,7,20,12],[14,11,15,12],[10,11,11,12],[12,11,13,12],[19,1,19,3],[10,10,11,10],[12,10,13,10],[14,8,15,8],[14,9,15,9],[14,10,15,10],[10,8,11,8],[10,9,11,9],[12,9,13,9],[12,8,13,8],[16,1,16,3]]}
[]
[]
[]
[]
[]
[]
[]
[]
[null,null,null,"1.",{"$f":"Opisy!A11","v":"Wybierz system:"}]
[]
[null,null,null,null,null,null,null,null,{"$f":"Opisy!A80","v":"Wysokość:"},2200,"mm",{"$f":"Opisy!A83","v":"Maksimum 3000mm"}]
[null,null,null,"2.",{"$f":"Opisy!A77","v":"Wymiary dla:"}]
[null,null,null,null,null,{"$f":"Opisy!A78","v":"Wnęki"},null,null,{"$f":"Opisy!A81","v":"Szerokość:"},1800,"mm",{"$f":"Opisy!A84","v":"Maksimum 4050mm"}]
[null,null,null,null,null,{"$f":"Opisy!A79","v":"Korpusu szafy"}]
[null,null,null,null,null,null,null,null,{"$f":"Opisy!A82","v":"Głębokość:"},700,"mm",{"$f":"Opisy!A137","v":"Minimum 300mm"}]
[]
["3.",{"$f":"Opisy!A85","v":"Grubość płyty na korpus Gp:"},null,null,18,{"$f":"Opisy!A89","v":"mm (minimum 16 mm)"}]
[null,{"$f":"Opisy!A86","v":"Wysokość cokołu Hc :"},null,null,100,{"$f":"Opisy!A90","v":"mm (minimum 50 mm)"}]
[null,{"$f":"Opisy!A87","v":"Grubość płyty drzwi Gd:"},null,null,18,{"$f":"Opisy!A91","v":"mm (16 - 22 mm)"}]
[null,{"$f":"Opisy!A88","v":"Szerokość zakładki Z:"},null,null,20,{"$f":"Opisy!A92","v":"mm (minimum 20 mm)"}]
[null,null,null,null,null,null,null,{"$f":"IF(M31>50,Opisy!A142,\" \")","v":" "}]
[null,null,null,null,null,{"$f":"Opisy!A94","v":"Wymiary szafy - drzwi nakładane"}]
[null,null,null,null,null,{"$f":"Opisy!A95","v":"Korpus:"},null,{"$f":"Opisy!A103","v":"Wieniec górny i dolny:"},null,{"$f":"Opisy!A105","v":"Bok lewy:"},null,{"$f":"Opisy!A107","v":"Przegrody pionowe:"}]
[null,null,null,null,null,{"$f":"Opisy!A96","v":"Wysokość Ws:"},{"$f":"IF(OR(Wys.wprowadzana>3000,Szer.wprowadzana>4050,Gleb.wprowadzana<300,Wys.cokolu<50),\"-\",'Overline - Obliczenia'!P4)","v":2200},{"$f":"I13","v":"Szerokość:"},{"$f":"IF(OR(Wys.wprowadzana>3000,Szer.wprowadzana>4050,Gleb.wprowadzana<300,Wys.cokolu<50),\"-\",'Overline - Obliczenia'!R4)","v":1764},{"$f":"I11","v":"Wysokość:"},{"$f":"IF(OR(Wys.wprowadzana>3000,Szer.wprowadzana>4050,Gleb.wprowadzana<300,Wys.cokolu<50),\"-\",'Overline - Obliczenia'!T4)","v":2200},{"$f":"J24","v":"Wysokość:"},{"$f":"IF(OR(Wys.wprowadzana>3000,Szer.wprowadzana>4050,Gleb.wprowadzana<300,Wys.cokolu<50),\"-\",'Overline - Obliczenia'!V4)","v":2019}]
[null,null,null,null,null,{"$f":"Opisy!A97","v":"Szerokość Ss:"},{"$f":"IF(OR(Wys.wprowadzana>3000,Szer.wprowadzana>4050,Gleb.wprowadzana<300,Wys.cokolu<50),\"-\",'Overline - Obliczenia'!P5)","v":1800},{"$f":"I15","v":"Głębokość:"},{"$f":"IF(OR(Wys.wprowadzana>3000,Szer.wprowadzana>4050,Gleb.wprowadzana<300,Wys.cokolu<50),\"-\",'Overline - Obliczenia'!R5)","v":638},{"$f":"I15","v":"Głębokość:"},{"$f":"IF(OR(Wys.wprowadzana>3000,Szer.wprowadzana>4050,Gleb.wprowadzana<300,Wys.cokolu<50),\"-\",'Overline - Obliczenia'!T5)","v":673},{"$f":"J25","v":"Głębokość:"},{"$f":"IF(OR(Wys.wprowadzana>3000,Szer.wprowadzana>4050,Gleb.wprowadzana<300,Wys.cokolu<50),\"-\",'Overline - Obliczenia'!V5)","v":628}]
[null,null,null,null,null,{"$f":"Opisy!A98","v":"Głębokość Gs:"},{"$f":"IF(OR(Wys.wprowadzana>3000,Szer.wprowadzana>4050,Gleb.wprowadzana<300,Wys.cokolu<50),\"-\",'Overline - Obliczenia'!P6)","v":700},{"$f":"Opisy!A114","v":"Grubość:"},{"$f":"IF(OR(Wys.wprowadzana>3000,Szer.wprowadzana>4050,Gleb.wprowadzana<300,Wys.cokolu<50),\"-\",'Overline - Obliczenia'!R6)","v":18},{"$f":"H30","v":"Grubość:"},{"$f":"IF(OR(Wys.wprowadzana>3000,Szer.wprowadzana>4050,Gleb.wprowadzana<300,Wys.cokolu<50),\"-\",'Overline - Obliczenia'!T6)","v":18},{"$f":"J26","v":"Grubość:"},{"$f":"IF(OR(Wys.wprowadzana>3000,Szer.wprowadzana>4050,Gleb.wprowadzana<300,Wys.cokolu<50),\"-\",'Overline - Obliczenia'!V6)","v":18}]
[null,null,null,null,null,{"$f":"Opisy!A99","v":"Wnętrze korpusu:"},null,{"$f":"Opisy!A104","v":"Wymiary cokołu:"},null,{"$f":"Opisy!A106","v":"Bok prawy:"},null,{"$f":"Opisy!A108","v":"Wymiary drzwi:"}]
[null,null,null,null,null,{"$f":"Opisy!A100","v":"Wysokość Wu:"},{"$f":"IF(OR(Wys.wprowadzana>3000,Szer.wprowadzana>4050,Gleb.wprowadzana<300,Wys.cokolu<50),\"-\",'Overline - Obliczenia'!P8)","v":2019},{"$f":"I11","v":"Wysokość:"},{"$f":"IF(OR(Wys.wprowadzana>3000,Szer.wprowadzana>4050,Gleb.wprowadzana<300,Wys.cokolu<50),\"-\",'Overline - Obliczenia'!R8)","v":100},{"$f":"J24","v":"Wysokość:"},{"$f":"IF(OR(Wys.wprowadzana>3000,Szer.wprowadzana>4050,Gleb.wprowadzana<300,Wys.cokolu<50),\"-\",'Overline - Obliczenia'!T8)","v":2200},{"$f":"Opisy!A110","v":"Wysokość Wd:"},{"$f":"IF(OR(Wys.wprowadzana>3000,Szer.wprowadzana>4050,Gleb.wprowadzana<300,Wys.cokolu<50),\"-\",'Overline - Obliczenia'!V8)","v":2123}]
[null,null,null,null,null,{"$f":"Opisy!A101","v":"Szerokość Sw:"},{"$f":"IF(OR(Wys.wprowadzana>3000,Szer.wprowadzana>4050,Gleb.wprowadzana<300,Wys.cokolu<50),\"-\",'Overline - Obliczenia'!P9)","v":1764},{"$f":"I13","v":"Szerokość:"},{"$f":"IF(OR(Wys.wprowadzana>3000,Szer.wprowadzana>4050,Gleb.wprowadzana<300,Wys.cokolu<50),\"-\",'Overline - Obliczenia'!R9)","v":1764},{"$f":"J25","v":"Głębokość:"},{"$f":"IF(OR(Wys.wprowadzana>3000,Szer.wprowadzana>4050,Gleb.wprowadzana<300,Wys.cokolu<50),\"-\",'Overline - Obliczenia'!T9)","v":644},{"$f":"Opisy!A111","v":"Szerokość Sd:"},{"$f":"IF(OR(Wys.wprowadzana>3000,Szer.wprowadzana>4050,Gleb.wprowadzana<300,Wys.cokolu<50),\"-\",'Overline - Obliczenia'!V9)","v":910}]
[null,null,null,null,null,{"$f":"Opisy!A102","v":"Głębokość Gu:"},{"$f":"IF(OR(Wys.wprowadzana>3000,Szer.wprowadzana>4050,Gleb.wprowadzana<300,Wys.cokolu<50),\"-\",'Overline - Obliczenia'!P10)","v":638},{"$f":"Opisy!A114","v":"Grubość:"},{"$f":"IF(OR(Wys.wprowadzana>3000,Szer.wprowadzana>4050,Gleb.wprowadzana<300,Wys.cokolu<50),\"-\",'Overline - Obliczenia'!R10)","v":18},{"$f":"J26","v":"Grubość:"},{"$f":"IF(OR(Wys.wprowadzana>3000,Szer.wprowadzana>4050,Gleb.wprowadzana<300,Wys.cokolu<50),\"-\",'Overline - Obliczenia'!T10)","v":18},{"$f":"Opisy!A112","v":"Grubość Gd:"},{"$f":"IF(OR(Wys.wprowadzana>3000,Szer.wprowadzana>4050,Gleb.wprowadzana<300,Wys.cokolu<50),\"-\",'Overline - Obliczenia'!V10)","v":18}]
[null,null,{"$f":"C45","v":"* - Waga skrzydła została wyliczona dla wypełnienia wykonanego z płyty wiórowej (620kg/m3) lub szkła zwykłego o grubości 4mm (2800kg/m3), bez łączeń."},null,null,null,null,null,null,null,{"$f":"Opisy!A141","v":"Waga skrzydła [kg]"},null,{"$f":"(M28*M29*M30/1000000000)*620+0.5","v":22.0603388}]
[]
[]
[]
[null,null,null,null,null,null,null,{"$f":"IF(M45>50,Opisy!A142,\" \")","v":" "}]
[null,null,null,null,null,{"$f":"Opisy!A109","v":"Wymiary szafy - drzwi wpuszczane"}]
[null,null,null,null,null,{"$f":"F23","v":"Korpus:"},null,{"$f":"H23","v":"Wieniec górny i dolny:"},null,{"$f":"J23","v":"Bok lewy:"},null,{"$f":"L23","v":"Przegrody pionowe:"}]
[null,null,null,null,null,{"$f":"F24","v":"Wysokość Ws:"},{"$f":"IF(OR(Wys.wprowadzana>3000,Szer.wprowadzana>4050,Gleb.wprowadzana<300,Wys.cokolu<50),\"-\",'Overline - Obliczenia'!P15)","v":2200},{"$f":"H24","v":"Szerokość:"},{"$f":"IF(OR(Wys.wprowadzana>3000,Szer.wprowadzana>4050,Gleb.wprowadzana<300,Wys.cokolu<50),\"-\",'Overline - Obliczenia'!R15)","v":1764},{"$f":"J24","v":"Wysokość:"},{"$f":"IF(OR(Wys.wprowadzana>3000,Szer.wprowadzana>4050,Gleb.wprowadzana<300,Wys.cokolu<50),\"-\",'Overline - Obliczenia'!T15)","v":2200},{"$f":"L24","v":"Wysokość:"},{"$f":"IF(OR(Wys.wprowadzana>3000,Szer.wprowadzana>4050,Gleb.wprowadzana<300,Wys.cokolu<50),\"-\",'Overline - Obliczenia'!V15)","v":2019}]
[null,null,null,null,null,{"$f":"F25","v":"Szerokość Ss:"},{"$f":"IF(OR(Wys.wprowadzana>3000,Szer.wprowadzana>4050,Gleb.wprowadzana<300,Wys.cokolu<50),\"-\",'Overline - Obliczenia'!P16)","v":1800},{"$f":"H25","v":"Głębokość:"},{"$f":"IF(OR(Wys.wprowadzana>3000,Szer.wprowadzana>4050,Gleb.wprowadzana<300,Wys.cokolu<50),\"-\",'Overline - Obliczenia'!R16)","v":638},{"$f":"J25","v":"Głębokość:"},{"$f":"IF(OR(Wys.wprowadzana>3000,Szer.wprowadzana>4050,Gleb.wprowadzana<300,Wys.cokolu<50),\"-\",'Overline - Obliczenia'!T16)","v":700},{"$f":"L25","v":"Głębokość:"},{"$f":"IF(OR(Wys.wprowadzana>3000,Szer.wprowadzana>4050,Gleb.wprowadzana<300,Wys.cokolu<50),\"-\",'Overline - Obliczenia'!V16)","v":628}]
[null,null,null,null,null,{"$f":"F26","v":"Głębokość Gs:"},{"$f":"IF(OR(Wys.wprowadzana>3000,Szer.wprowadzana>4050,Gleb.wprowadzana<300,Wys.cokolu<50),\"-\",'Overline - Obliczenia'!P17)","v":700},{"$f":"H26","v":"Grubość:"},{"$f":"IF(OR(Wys.wprowadzana>3000,Szer.wprowadzana>4050,Gleb.wprowadzana<300,Wys.cokolu<50),\"-\",'Overline - Obliczenia'!R17)","v":18},{"$f":"J26","v":"Grubość:"},{"$f":"IF(OR(Wys.wprowadzana>3000,Szer.wprowadzana>4050,Gleb.wprowadzana<300,Wys.cokolu<50),\"-\",'Overline - Obliczenia'!T17)","v":18},{"$f":"L26","v":"Grubość:"},{"$f":"IF(OR(Wys.wprowadzana>3000,Szer.wprowadzana>4050,Gleb.wprowadzana<300,Wys.cokolu<50),\"-\",'Overline - Obliczenia'!V17)","v":18}]
[null,null,null,null,null,{"$f":"F27","v":"Wnętrze korpusu:"},null,{"$f":"H27","v":"Wymiary cokołu:"},null,{"$f":"J27","v":"Bok prawy:"},null,{"$f":"L27","v":"Wymiary drzwi:"}]
[null,null,null,null,null,{"$f":"F28","v":"Wysokość Wu:"},{"$f":"IF(OR(Wys.wprowadzana>3000,Szer.wprowadzana>4050,Gleb.wprowadzana<300,Wys.cokolu<50),\"-\",'Overline - Obliczenia'!P19)","v":2019},{"$f":"H28","v":"Wysokość:"},{"$f":"IF(OR(Wys.wprowadzana>3000,Szer.wprowadzana>4050,Gleb.wprowadzana<300,Wys.cokolu<50),\"-\",'Overline - Obliczenia'!R19)","v":100},{"$f":"J28","v":"Wysokość:"},{"$f":"IF(OR(Wys.wprowadzana>3000,Szer.wprowadzana>4050,Gleb.wprowadzana<300,Wys.cokolu<50),\"-\",'Overline - Obliczenia'!T19)","v":2200},{"$f":"L28","v":"Wysokość Wd:"},{"$f":"IF(OR(Wys.wprowadzana>3000,Szer.wprowadzana>4050,Gleb.wprowadzana<300,Wys.cokolu<50),\"-\",'Overline - Obliczenia'!V19)","v":2123}]
[null,null,null,null,null,{"$f":"F29","v":"Szerokość Sw:"},{"$f":"IF(OR(Wys.wprowadzana>3000,Szer.wprowadzana>4050,Gleb.wprowadzana<300,Wys.cokolu<50),\"-\",'Overline - Obliczenia'!P20)","v":1764},{"$f":"H29","v":"Szerokość:"},{"$f":"IF(OR(Wys.wprowadzana>3000,Szer.wprowadzana>4050,Gleb.wprowadzana<300,Wys.cokolu<50),\"-\",'Overline - Obliczenia'!R20)","v":1764},{"$f":"J29","v":"Głębokość:"},{"$f":"IF(OR(Wys.wprowadzana>3000,Szer.wprowadzana>4050,Gleb.wprowadzana<300,Wys.cokolu<50),\"-\",'Overline - Obliczenia'!T20)","v":671},{"$f":"L29","v":"Szerokość Sd:"},{"$f":"IF(OR(Wys.wprowadzana>3000,Szer.wprowadzana>4050,Gleb.wprowadzana<300,Wys.cokolu<50),\"-\",'Overline - Obliczenia'!V20)","v":892}]
[null,null,null,null,null,{"$f":"F30","v":"Głębokość Gu:"},{"$f":"IF(OR(Wys.wprowadzana>3000,Szer.wprowadzana>4050,Gleb.wprowadzana<300,Wys.cokolu<50),\"-\",'Overline - Obliczenia'!P21)","v":638},{"$f":"H30","v":"Grubość:"},{"$f":"IF(OR(Wys.wprowadzana>3000,Szer.wprowadzana>4050,Gleb.wprowadzana<300,Wys.cokolu<50),\"-\",'Overline - Obliczenia'!R21)","v":18},{"$f":"J30","v":"Grubość:"},{"$f":"IF(OR(Wys.wprowadzana>3000,Szer.wprowadzana>4050,Gleb.wprowadzana<300,Wys.cokolu<50),\"-\",'Overline - Obliczenia'!T21)","v":18},{"$f":"L30","v":"Grubość Gd:"},{"$f":"IF(OR(Wys.wprowadzana>3000,Szer.wprowadzana>4050,Gleb.wprowadzana<300,Wys.cokolu<50),\"-\",'Overline - Obliczenia'!V21)","v":18}]
[null,null,{"$f":"Opisy!A28","v":"* - Waga skrzydła została wyliczona dla wypełnienia wykonanego z płyty wiórowej (620kg/m3) lub szkła zwykłego o grubości 4mm (2800kg/m3), bez łączeń."},null,null,null,null,null,null,null,{"$f":"K31","v":"Waga skrzydła [kg]"},null,{"$f":"(M42*M43*M44/1000000000)*620+0.5","v":21.633870560000002}]
[]
[]
[]
[]
[null,{"$f":"Opisy!A113","v":"Notatki:"}]
[]
[]
[]
[]
[]
[]
[]
[]
[]
[]
[]
[]
[]
[]
[]
[]
[null,null,null,null,null,null,null,null,null,null,null,null,"GTV Poland Sp. z o.o. Sp. k."]
[null,null,null,null,null,null,null,null,null,null,null,null,"ul. Przejazdowa 21, 05-800 Pruszków, Polska"]
[null,null,null,null,null,null,null,null,null,null,null,null,"www.gtv.com.pl"]
[null,null,null,null,null,null,null,null,null,null,null,null,"gtv.tech@gtv.com.pl"]

{"sheet":"Overline - Obliczenia","index":3,"n_rows":21,"n_cols":22,"rows_kept":21,"cut":false,"hidden":true,"merged":[[17,14,17,15],[17,16,17,17],[17,18,17,19],[17,20,17,21],[6,14,6,15],[6,16,6,17],[6,18,6,19],[6,20,6,21],[12,14,12,21],[13,14,13,15],[13,16,13,17],[13,18,13,19],[13,20,13,21],[4,5,4,7],[1,14,1,21],[2,14,2,15],[2,16,2,17],[2,18,2,19],[2,20,2,21],[1,5,1,7],[2,5,2,7],[3,5,3,7],[14,5,15,6],[10,5,10,7],[11,5,11,7],[12,5,12,7],[6,5,6,6],[7,5,7,6],[8,5,8,6]]}
[]
[null,"Wybrany system:",1,{"$f":"VLOOKUP(C2,A8:B38,2,FALSE)","v":"OVERILINE"},null,"Grubość płyty na korpus Gp",null,null,{"$f":"VLOOKUP(H16,F17:G19,2,FALSE)","v":18},null,null,null,null,null,"Wymiary szafy - drzwi nakładane"]
[null,"Typ zabudowy:",2,null,null,"Wysokość cokołu Hc ",null,null,{"$f":"OVERLINE!E18","v":100},null,null,null,null,null,"Korpus:",null,"Wieniec górny i dolny",null,"Bok lewy",null,"Przegrody pionowe"]
[null,"Układ drzwi",null,null,null,"Grubość płyty drzwi Gd",null,null,{"$f":"VLOOKUP(I16,F17:G19,2,FALSE)","v":18},null,null,null,null,null,"Wysokość Ws",{"$f":"Wys.szafy","v":2200},"Szerokość",{"$f":"P9","v":1764},"Wysokość",{"$f":"Wys.szafy","v":2200},"Wysokość",{"$f":"Wys.uzyt.szafy","v":2019}]
[null,null,null,null,null,"Szerokość zakładki Z",null,null,{"$f":"OVERLINE!E20","v":20},null,null,null,null,null,"Szerokość Ss",{"$f":"Szer.szafy","v":1800},"Głębokość",{"$f":"P10","v":638},"Głębokość",{"$f":"Gleb.uzyt.szafy+35","v":673},"Głębokość",{"$f":"Gleb.uzyt.szafy-10","v":628}]
[null,"Systemy podwieszane",null,null,null,null,null,null,null,null,null,null,null,null,"Głębokość Gs",{"$f":"Gleb.szafy","v":700},"Grubość",{"$f":"Grub.plyty.korp","v":18},"Grubość",{"$f":"Grub.plyty.korp","v":18},"Grubość",{"$f":"Grub.plyty.korp","v":18}]
[null,null,null,null,null,"Wysokość szafy",null,{"$f":"IF(AND(OR(Wybrany_System_podw=1,Wybrany_System_podw=2),Typ_zabudowy=1),Wys.wprowadzana-25,Wys.wprowadzana)","v":2200},null,null,null,null,null,null,"Wnętrze korpusu:",null,"Wymiary cokołu",null,"Bok prawy",null,"Wymiary drzwi"]
[null,null,null,null,null,"Szerokość szafy",null,{"$f":"IF(AND(OR(Wybrany_System_podw=1,Wybrany_System_podw=2),Typ_zabudowy=1),Szer.wprowadzana-7,Szer.wprowadzana)","v":1800},null,null,null,null,null,null,"Wysokość Wu",{"$f":"Wys.uzyt.szafy","v":2019},"Wysokość",{"$f":"Wys.cokolu","v":100},"Wysokość",{"$f":"Wys.szafy","v":2200},"Wysokość Wd",{"$f":"IF(Wybrany_System_podw=1,Wys.szafy-Wys.cokolu-Grub.plyty.korp+41,IF(Wybrany_System_podw=2,Wys.szafy-Wys.cokolu-Grub.plyty.korp+39,\"-\"))","v":2123}]
[1,"OVERILINE",null,null,null,"Głębokość szafy",null,{"$f":"Gleb.wprowadzana","v":700},null,null,null,null,null,null,"Szerokość Sw",{"$f":"Szer.uzyt.szafy","v":1764},"Długość",{"$f":"P9","v":1764},"Głębokość",{"$f":"Gleb.uzyt.szafy+6","v":644},"Szerokość Sd",{"$f":"(Szer.szafy+Szer.zakladki)/2","v":910}]
[2,"OVERLINE PLUS",null,null,null,null,null,null,null,null,null,null,null,null,"Głębokość Gu",{"$f":"Gleb.uzyt.szafy","v":638},"Grubość",{"$f":"Grub.plyty.korp","v":18},"Grubość",{"$f":"Grub.plyty.korp","v":18},"Grubość Gd",{"$f":"Grub.drzwi","v":18}]
[null,null,null,null,null,"Wysokość użyteczna szafy",null,null,{"$f":"Wys.szafy-Wys.cokolu-2*Grub.plyty.korp-45","v":2019}]
[null,null,null,null,null,"Szerokość użyteczna szafy",null,null,{"$f":"Szer.szafy-2*Grub.plyty.korp","v":1764}]
[null,null,null,null,null,"Głębokość użyteczna szafy",null,null,{"$f":"Gleb.szafy-Grub.drzwi-44","v":638},null,null,null,null,null,"Wymiary szafy - drzwi wpuszczane"]
[null,null,null,null,null,null,null,null,null,null,null,null,null,null,"Korpus:",null,"Wieniec górny i dolny",null,"Bok lewy",null,"Przegrody pionowe"]
[null,null,null,null,null,"Grubości płyt",null,"korpus","drzwi",null,null,null,null,null,"Wysokość Ws",{"$f":"Wys.szafy","v":2200},"Szerokość",{"$f":"P20","v":1764},"Wysokość",{"$f":"Wys.szafy","v":2200},"Wysokość",{"$f":"Wys.uzyt.szafy","v":2019}]
[null,null,null,null,null,null,null,2,2,null,null,null,null,null,"Szerokość Ss",{"$f":"Szer.szafy","v":1800},"Głębokość",{"$f":"P21","v":638},"Głębokość",{"$f":"Gleb.uzyt.szafy+Grub.drzwi+44","v":700},"Głębokość",{"$f":"Gleb.uzyt.szafy-10","v":628}]
[null,null,null,null,null,1,16,null,null,null,null,null,null,null,"Głębokość Gs",{"$f":"Gleb.szafy","v":700},"Grubość",{"$f":"Grub.plyty.korp","v":18},"Grubość",{"$f":"Grub.plyty.korp","v":18},"Grubość",{"$f":"Grub.plyty.korp","v":18}]
[null,null,null,null,null,2,18,null,null,null,null,null,null,null,"Wnętrze korpusu:",null,"Wymiary cokołu",null,"Bok prawy",null,"Wymiary drzwi"]
[null,null,null,null,null,3,22,null,null,null,null,null,null,null,"Wysokość Wu",{"$f":"Wys.uzyt.szafy","v":2019},"Wysokość",{"$f":"Wys.cokolu","v":100},"Wysokość",{"$f":"Wys.szafy","v":2200},"Wysokość Wd",{"$f":"V8","v":2123}]
[null,null,null,null,null,null,null,null,null,null,null,null,null,null,"Szerokość Sw",{"$f":"Szer.uzyt.szafy","v":1764},"Długość",{"$f":"Szer.uzyt.szafy","v":1764},"Głębokość",{"$f":"Gleb.uzyt.szafy+Grub.drzwi+15","v":671},"Szerokość Sd",{"$f":"(Szer.szafy-2*Grub.plyty.korp+Szer.zakladki)/2","v":892}]
[null,null,null,null,null,null,null,null,null,null,null,null,null,null,"Głębokość Gu",{"$f":"Gleb.uzyt.szafy","v":638},"Grubość",{"$f":"Grub.plyty.korp","v":18},"Grubość",{"$f":"Grub.plyty.korp","v":18},"Grubość Gd",{"$f":"Grub.drzwi","v":18}]

{"sheet":"QUANTUM","index":4,"n_rows":70,"n_cols":14,"rows_kept":70,"cut":false,"hidden":false,"merged":[[7,9,9,10],[7,11,9,12],[23,8,23,11],[16,8,16,11],[15,5,27,6],[35,1,35,5],[30,7,30,12],[31,7,31,12],[15,3,27,4],[15,1,27,2],[35,7,35,13],[34,7,34,13],[49,1,49,4],[53,1,53,4],[57,1,57,4],[37,1,37,4],[44,1,44,4],[42,1,42,5],[50,6,53,6],[50,7,53,7],[49,6,49,8],[50,8,53,8],[36,7,36,11],[36,12,36,13],[39,7,41,13]]}
[]
[]
[]
[]
[]
[]
[]
[]
[]
[]
[]
["1.",{"$f":"Opisy!A11","v":"Wybierz system:"}]
[]
["2.",{"$f":"Opisy!A115","v":"Opcje montażu:"},null,null,null,null,null,"3.",{"$f":"Opisy!A124","v":"Wybór zabudowy:"}]
[]
[]
[null,null,null,null,null,null,null,null,{"$f":"Opisy!A125","v":"Wariant A"}]
[]
[]
[]
[]
[]
[]
[null,null,null,null,null,null,null,null,{"$f":"Opisy!A126","v":"Wariant B"}]
[]
[]
[]
[]
[]
[]
["4.",{"$f":"Opisy!A120","v":"Wymiary otworu:"},null,null,{"$f":"Opisy!A121","v":"Wysokość WO:"},2700,{"$f":"E40","v":"mm"},{"$f":"IF(AND(Wybr.system.przejsciowy>3,QUANTUM!D46>2700),Opisy!A138,\" \")","v":" "}]
[null,null,null,null,{"$f":"Opisy!A122","v":"Szerokość SO:"},800,{"$f":"E39","v":"mm"},{"$f":"IF(AND(Wybr.system.przejsciowy>3,'Quantum - obliczenia'!$G$26,$D$60>6000,'Quantum - obliczenia'!$G$27<3),Opisy!A140,IF(AND('Quantum - obliczenia'!$G$26,$D$60>3000,'Quantum - obliczenia'!$G$27=3),Opisy!A139,IF(AND(Wybr.system.przejsciowy>3,D60>6000),Opisy!A140,\" \")))","v":" "}]
[null,null,null,null,{"$f":"Opisy!A133","v":"Szerokość zakładki X:"},46,{"$f":"G31","v":"mm"},{"$f":"Opisy!A123","v":"<----- Dla ukrytego prowadnika Xmin = 46mm"}]
[]
[null,null,null,null,null,null,null,{"$f":"IF(AND(Wybr.system.przejsciowy=2,MAX(H39:L39)>50),Opisy!A142,IF(AND(Wybr.system.przejsciowy>3,MAX(QUANTUM!M39:N39)>50),Opisy!A142,\" \"))","v":" "}]
[null,{"$f":"Opisy!A128","v":"Wyliczenia dla rozwiązania bezramowego (Quantum)"},null,null,null,null,null,{"$f":"Opisy!A141","v":"Waga skrzydła [kg]"}]
[null,null,null,null,null,null,null,"QUANTUM",null,null,null,null,"QUANTUM R"]
[null,{"$f":"Opisy!A134","v":"Wymiary skrzydła drzwi:"},null,null,null,null,null,16,18,22,25,28,4,10]
[null,{"$f":"Opisy!A52","v":"Wysokość drzwi"},"WD",{"$f":"IF('Quantum - obliczenia'!$D$1='Quantum - obliczenia'!$B$4,HLOOKUP(Opcja.montazu,'Quantum - obliczenia'!G2:I6,3,FALSE),\"-\")","v":"-"},{"$f":"E40","v":"mm"},null,null,{"$f":"IF($D$39=\"-\",\"-\",$D$39*$D$40*H38*620/1000000000+0.34)","v":"-"},{"$f":"IF($D$39=\"-\",\"-\",$D$39*$D$40*I38*620/1000000000+0.34)","v":"-"},"-","-","-",{"$f":"IF(Wybr.system.przejsciowy>3,VLOOKUP('Quantum - obliczenia'!$H$43,'Quantum - obliczenia'!$E$42:$G$49,3,0),\"-\")","v":26.564807999999999},{"$f":"IF(Wybr.system.przejsciowy>3,VLOOKUP('Quantum - obliczenia'!$H$42,'Quantum - obliczenia'!$E$42:$G$49,3,0),\"-\")","v":16.4172166}]
[null,{"$f":"Opisy!A51","v":"Szerokość drzwi"},"SD",{"$f":"IF('Quantum - obliczenia'!D1='Quantum - obliczenia'!B4,HLOOKUP(Opcja.montazu,'Quantum - obliczenia'!G2:I5,2,FALSE),\"-\")","v":"-"},{"$f":"Opisy!A46","v":"mm"},null,null,{"$f":"Opisy!A28","v":"* - Waga skrzydła została wyliczona dla wypełnienia wykonanego z płyty wiórowej (620kg/m3) lub szkła zwykłego o grubości 4mm (2800kg/m3), bez łączeń."}]
[null,{"$f":"Opisy!A127","v":"Długość toru"},"DT",{"$f":"IF('Quantum - obliczenia'!D1='Quantum - obliczenia'!B4,HLOOKUP(Opcja.montazu,'Quantum - obliczenia'!G2:I6,4,FALSE),\"-\")","v":"-"},{"$f":"E40","v":"mm"},{"$f":"IF(AND(Wybr.system.przejsciowy=2,D41>3000),Opisy!A143,\" \")","v":" "}]
[]
[null,{"$f":"Opisy!A129","v":"Wyliczenia dla rozwiązania ramowego (Quantum R)"}]
[]
[null,{"$f":"Opisy!A134","v":"Wymiary skrzydła drzwi:"},null,null,null,null,null,{"$f":"Opisy!A31","v":"Łączniki"}]
[null,{"$f":"B39","v":"Wysokość drzwi"},"WD",{"$f":"IF(Wybr.system.przejsciowy>3,HLOOKUP(Opcja.montazu,'Quantum - obliczenia'!$G$2:$I$5,'Quantum - obliczenia'!L4,FALSE),\"-\")","v":2644},{"$f":"E47","v":"mm"}]
[null,{"$f":"B40","v":"Szerokość drzwi"},"SD",{"$f":"IF(Wybr.system.przejsciowy>3,HLOOKUP(Opcja.montazu,'Quantum - obliczenia'!$G$2:$I$5,'Quantum - obliczenia'!L3,FALSE),\"-\")","v":846},{"$f":"Opisy!G46","v":"mm"}]
[null,{"$f":"B41","v":"Długość toru"},"DT",{"$f":"IF(Wybr.system.przejsciowy>3,HLOOKUP(Opcja.montazu,'Quantum - obliczenia'!$G$2:$I$5,'Quantum - obliczenia'!L5,FALSE),\"-\")","v":1646},{"$f":"E47","v":"mm"},{"$f":"IF(AND(Wybr.system.przejsciowy>3,D48>3000),Opisy!A143,\" \")","v":" "}]
[]
[null,{"$f":"Opisy!A130","v":"Wymiary wypełnienia z płyty 10mm"},null,null,null,null,{"$f":"IF(AND(Wybr.system.przejsciowy>3,Oblicz.locznikow),\"↓10/4mm↓\",\" \")","v":"↓10/4mm↓"}]
[null,{"$f":"Opisy!A56","v":"Szer. wyp. 10mm"},"SW10",{"$f":"IF(Wybr.system.przejsciowy>3,HLOOKUP(Opcja.montazu,'Quantum - obliczenia'!$F$2:$K$17,'Quantum - obliczenia'!L8,FALSE),\"-\")","v":803},{"$f":"$E$39","v":"mm"}]
[null,{"$f":"Opisy!A61","v":"Wys. wyp. 10mm"},"WW10",{"$f":"IF(Wybr.system.przejsciowy>3,HLOOKUP(Opcja.montazu,'Quantum - obliczenia'!$F$2:$K$17,'Quantum - obliczenia'!L9,FALSE),\"-\")","v":2551},{"$f":"$E$39","v":"mm"}]
[]
[null,{"$f":"Opisy!A131","v":"Wymiary wypełnienia ze szkła 4mm"}]
[null,{"$f":"Opisy!A57","v":"Szer. wyp. 4mm"},"SW4",{"$f":"IF(Wybr.system.przejsciowy>3,HLOOKUP(Opcja.montazu,'Quantum - obliczenia'!$F$2:$K$17,'Quantum - obliczenia'!L12,FALSE),\"-\")","v":800},{"$f":"$E$39","v":"mm"}]
[null,{"$f":"Opisy!A62","v":"Wys. wyp. 4mm"},"WW4",{"$f":"IF(Wybr.system.przejsciowy>3,HLOOKUP(Opcja.montazu,'Quantum - obliczenia'!$F$2:$K$17,'Quantum - obliczenia'!L13,FALSE),\"-\")","v":2550},{"$f":"$E$39","v":"mm"}]
[]
[null,{"$f":"Opisy!A132","v":"Wymiary profili aluminiowych"},null,null,null,null,{"$f":"Opisy!A36","v":"i (ilość łączników)"},null,2]
[null,{"$f":"Opisy!A63","v":"Długość rączki"},"DR",{"$f":"IF(Wybr.system.przejsciowy>3,HLOOKUP(Opcja.montazu,'Quantum - obliczenia'!$F$2:$K$17,'Quantum - obliczenia'!L16,FALSE),\"-\")","v":2644},{"$f":"$E$39","v":"mm"},null,{"$f":"Opisy!A135","v":"Wys. el. z płyty"},null,{"$f":"HLOOKUP(Opcja.montazu,'Quantum - obliczenia'!$F$2:$I$23,'Quantum - obliczenia'!L22,FALSE)","v":845.33333333333337}]
[null,{"$f":"Opisy!A64","v":"Dł. listew poz."},"DLP",{"$f":"IF(Wybr.system.przejsciowy>3,HLOOKUP(Opcja.montazu,'Quantum - obliczenia'!$F$2:$K$17,'Quantum - obliczenia'!L17,FALSE),\"-\")","v":786},{"$f":"$E$39","v":"mm"},null,{"$f":"Opisy!A136","v":"Wys. el. ze szkła"},null,{"$f":"HLOOKUP(Opcja.montazu,'Quantum - obliczenia'!$F$2:$I$23,'Quantum - obliczenia'!L23,FALSE)","v":843}]
[]
[]
[]
[]
[]
[]
[null,null,null,null,null,null,null,null,null,null,null,null,"GTV Poland Sp. z o.o. Sp. k."]
[null,null,null,null,null,null,null,null,null,null,null,null,"ul. Przejazdowa 21, 05-800 Pruszków, Polska"]
[null,null,null,null,null,null,null,null,null,null,null,null,"www.gtv.com.pl"]
[null,null,null,null,null,null,null,null,null,null,null,null,"gtv.tech@gtv.com.pl"]

{"sheet":"Quantum - obliczenia","index":5,"n_rows":51,"n_cols":12,"rows_kept":51,"cut":false,"hidden":true,"merged":[[40,4,40,7],[0,6,0,8],[0,9,0,10],[6,5,6,8],[10,5,10,8],[14,5,14,8]]}
[null,"Wybrany system",4,{"$f":"VLOOKUP(C1,A3:B7,2,FALSE)","v":"QUANTUM R + ARCO"},null,null,"Opcje montażu",null,null,"Wariant zabudowy"]
[null,null,null,null,null,null,1,2,3,4,5,1]
[1,"--Przejściowe bezramowe--","WO",{"$f":"QUANTUM!F31","v":2700},null,"SD",{"$f":"HLOOKUP($C$26,J2:K3,2,FALSE)","v":846},{"$f":"HLOOKUP($C$26,J2:K3,2,FALSE)","v":846},{"$f":"HLOOKUP($C$26,J2:K3,2,FALSE)","v":846},{"$f":"Szer.Otw.przej+Szer.zakl.przej","v":846},{"$f":"Szer.Otw.przej+Szer.zakl.przej*2","v":892},2]
[2,"QUANTUM","SO",{"$f":"QUANTUM!F32","v":800},null,"WD",{"$f":"Wys.otw.przej-56","v":2644},{"$f":"Wys.otw.przej-58","v":2642},{"$f":"Wys.otw.przej+20","v":2720},"-","-",3]
[3,"----Przejściowe ramowe----","X",{"$f":"QUANTUM!F33","v":46},null,"DT",{"$f":"HLOOKUP($C$26,$J$2:$K$5,4,FALSE)","v":1646},{"$f":"HLOOKUP($C$26,$J$2:$K$5,4,FALSE)","v":1646},{"$f":"HLOOKUP($C$26,$J$2:$K$5,4,FALSE)","v":1646},{"$f":"Szer.Otw.przej+J3","v":1646},{"$f":"Szer.Otw.przej+K3","v":1692},4]
[4,"QUANTUM R + ARCO",null,null,null,null,null,null,null,null,null,5]
[5,"QUANTUM R + FALDA",null,null,null,{"$f":"Opisy!C130","v":"Wymiary wypełnienia z płyty 10mm"},null,null,null,null,null,6]
[null,null,null,null,null,"SW10",{"$f":"G3-43","v":803},{"$f":"H3-43","v":803},803,null,null,7]
[null,"Opcje montażu",1,null,null,"WW10",{"$f":"G4-93","v":2551},{"$f":"H4-93","v":2549},2627,null,null,8]
[null,{"$f":"Opisy!A116","v":"Bezpośredni montaż do sufitu"},null,null,null,null,null,null,null,null,null,9]
[null,{"$f":"Opisy!A117","v":"Montaż do sufitu  - uchwyt górny"},null,null,null,{"$f":"Opisy!C131","v":"Wymiary wypełnienia ze szkła 4mm"},null,null,null,null,null,10]
[null,{"$f":"Opisy!A118","v":"Montaż do ściany - uchwyt boczny"},null,null,null,"SW4",{"$f":"G3-46","v":800},{"$f":"H3-46","v":800},800,null,null,11]
[null,null,null,null,null,"WW4",{"$f":"G4-94","v":2550},{"$f":"H4-94","v":2548},2626,null,null,12]
[null,"Grubość wypełnienia",5,null,null,null,null,null,null,null,null,13]
[1,{"$f":"B5","v":"----Przejściowe ramowe----"},null,null,null,{"$f":"Opisy!C132","v":"Wymiary profili aluminiowych"},null,null,null,null,null,14]
[2,"10/4",null,null,null,"DR",{"$f":"G4","v":2644},{"$f":"H4","v":2642},2720,null,null,15]
[3,{"$f":"B3","v":"--Przejściowe bezramowe--"},null,null,null,"DLP",{"$f":"G3-60","v":786},{"$f":"H3-60","v":786},786,null,null,16]
[4,16,null,null,null,null,null,null,null,null,null,17]
[5,18,null,null,null,null,null,null,null,null,null,18]
[6,22,null,null,null,null,null,null,null,null,null,19]
[7,25,null,null,null,"Obliczenia z łącznikami",null,null,null,null,null,20]
[8,28,null,null,null,"płyta",{"$f":"VLOOKUP(Wybrany.lacznik.przej,E30:I32,3,FALSE)","v":845.33333333333337},{"$f":"VLOOKUP(Wybrany.lacznik.przej,E30:I32,4,FALSE)","v":844.66666666666663},{"$f":"VLOOKUP(Wybrany.lacznik.przej,E30:I32,5,FALSE)","v":870.66666666666663},null,null,21]
[null,null,null,null,null,"szkło",{"$f":"VLOOKUP(Wybrany.lacznik.przej,E33:I35,3,FALSE)","v":843},{"$f":"VLOOKUP(Wybrany.lacznik.przej,E33:I35,4,FALSE)","v":842.33333333333337},{"$f":"VLOOKUP(Wybrany.lacznik.przej,E33:I35,5,FALSE)","v":868.33333333333337},null,null,22]
[null,null,null,null,null,null,null,null,null,null,null,23]
[null,"Wariant zabudowy",1,null,null,null,null,null,null,null,null,24]
[1,{"$f":"Opisy!A125","v":"Wariant A"},{"$f":"IF(C25=1,4,5)","v":4},null,null,"Łączniki (TAK/NIE)",true,null,null,null,null,25]
[2,{"$f":"Opisy!A126","v":"Wariant B"},null,null,null,"Wybrany lacznik",1,null,null,null,null,26]
[null,null,null,null,null,"Warunek oblicznia łączników",{"$f":"IF(AND(Wybr.system.przejsciowy>3,Oblicz.locznikow),TRUE,FALSE)","v":true},null,null,null,null,27]
[null,null,null,null,null,"Liczba łączników",{"$f":"QUANTUM!I58","v":2},null,null,null,null,28]
[null,null,null,null,1,"A-HRS10-XXX-YY",{"$f":"IF(AND(Policz.laczniki,Wybrany.lacznik.przej=$E$30),(G$9-Liczba.lacznikow*7.5)/(Liczba.lacznikow+1),\"-\")","v":845.33333333333337},{"$f":"IF(AND(Policz.laczniki,Wybrany.lacznik.przej=$E$30),(H$9-Liczba.lacznikow*7.5)/(Liczba.lacznikow+1),\"-\")","v":844.66666666666663},{"$f":"IF(AND(Policz.laczniki,Wybrany.lacznik.przej=$E$30),(I$9-Liczba.lacznikow*7.5)/(Liczba.lacznikow+1),\"-\")","v":870.66666666666663},0.26800000000000002,null,29]
[null,null,null,null,2,"A-HR10-XXX-YY",{"$f":"IF(AND(Policz.laczniki,Wybrany.lacznik.przej=$E$31),(G$9-Liczba.lacznikow*1)/(Liczba.lacznikow+1),\"-\")","v":"-"},{"$f":"IF(AND(Policz.laczniki,Wybrany.lacznik.przej=$E$31),(H$9-Liczba.lacznikow*1)/(Liczba.lacznikow+1),\"-\")","v":"-"},{"$f":"IF(AND(Policz.laczniki,Wybrany.lacznik.przej=$E$31),(I$9-Liczba.lacznikow*1)/(Liczba.lacznikow+1),\"-\")","v":"-"},0.185,null,30]
[null,null,null,null,3,"A-HR10FL-XXX-YY",{"$f":"IF(AND(Policz.laczniki,Wybrany.lacznik.przej=$E$32),(G$9-Liczba.lacznikow*1)/(Liczba.lacznikow+1),\"-\")","v":"-"},{"$f":"IF(AND(Policz.laczniki,Wybrany.lacznik.przej=$E$32),(H$9-Liczba.lacznikow*1)/(Liczba.lacznikow+1),\"-\")","v":"-"},{"$f":"IF(AND(Policz.laczniki,Wybrany.lacznik.przej=$E$32),(I$9-Liczba.lacznikow*1)/(Liczba.lacznikow+1),\"-\")","v":"-"},0.13400000000000001,null,31]
[null,null,null,null,1,"A-HRS10-XXX-YY",{"$f":"IF(AND(Policz.laczniki,Wybrany.lacznik.przej=$E$30),(G13-Liczba.lacznikow*10.5)/(Liczba.lacznikow+1),\"-\")","v":843},{"$f":"IF(AND(Policz.laczniki,Wybrany.lacznik.przej=$E$30),(H13-Liczba.lacznikow*10.5)/(Liczba.lacznikow+1),\"-\")","v":842.33333333333337},{"$f":"IF(AND(Policz.laczniki,Wybrany.lacznik.przej=$E$30),(I13-Liczba.lacznikow*10.5)/(Liczba.lacznikow+1),\"-\")","v":868.33333333333337}]
[null,null,null,null,2,"A-HR10-XXX-YY",{"$f":"IF(AND(Policz.laczniki,Wybrany.lacznik.przej=$E$31),(G13-Liczba.lacznikow*4)/(Liczba.lacznikow+1),\"-\")","v":"-"},{"$f":"IF(AND(Policz.laczniki,Wybrany.lacznik.przej=$E$31),(H13-Liczba.lacznikow*4)/(Liczba.lacznikow+1),\"-\")","v":"-"},{"$f":"IF(AND(Policz.laczniki,Wybrany.lacznik.przej=$E$31),(I13-Liczba.lacznikow*4)/(Liczba.lacznikow+1),\"-\")","v":"-"}]
[null,null,null,null,3,"A-HR10FL-XXX-YY",{"$f":"IF(AND(Policz.laczniki,Wybrany.lacznik.przej=$E$32),(G13-Liczba.lacznikow*4)/(Liczba.lacznikow+1),\"-\")","v":"-"},{"$f":"IF(AND(Policz.laczniki,Wybrany.lacznik.przej=$E$32),(H13-Liczba.lacznikow*4)/(Liczba.lacznikow+1),\"-\")","v":"-"},{"$f":"IF(AND(Policz.laczniki,Wybrany.lacznik.przej=$E$32),(I13-Liczba.lacznikow*4)/(Liczba.lacznikow+1),\"-\")","v":"-"}]
[]
[]
[]
[]
[]
[null,"Obliczenia wagi QUANTUM R","ARCO","FALDA","Warunek wypełnienia tabeli z wagami do quantum r"]
[null,null,{"$f":"'Obliczenia-dolny'!U4","v":0.41799999999999998},{"$f":"'Obliczenia-dolny'!V4","v":0.46300000000000002},40,"ARCO PLYTA",{"$f":"Arco.plyta","v":15.995920599999998},{"$f":"Wybr.system.przejsciowy*10+Oblicz.locznikow","v":41}]
[null,"Płyta",{"$f":"QUANTUM!D51*QUANTUM!D52*QUANTUM!N38*620/1000000000","v":12.700408599999999},{"$f":"C43","v":12.700408599999999},80,"ARCO SZKLO",{"$f":"Arco.szklo","v":26.143511999999998},{"$f":"Wybr.system.przejsciowy*20+Oblicz.locznikow","v":81}]
[null,"Szkło",{"$f":"QUANTUM!D55*QUANTUM!D56*QUANTUM!M38*2800/1000000000","v":22.847999999999999},{"$f":"C44","v":22.847999999999999},41,"ARCO PLYTA LACZ",{"$f":"Arco.plyta.lacz","v":16.4172166}]
[null,"Aluminium",{"$f":"2*C42*QUANTUM!$D$59/1000+2*'Obliczenia-dolny'!$J$34*QUANTUM!$D$60/1000","v":2.9555119999999997},{"$f":"2*D42*QUANTUM!$D$59/1000+2*'Obliczenia-dolny'!$J$34*QUANTUM!$D$60/1000","v":3.1934719999999999},81,"ARCO SZKLO LACZ",{"$f":"Arco.szklo.lacz","v":26.564807999999999}]
[null,"Okucia",0.34,{"$f":"0.34","v":0.34},50,"FALDA PLYTA",{"$f":"Falda.plyta","v":16.233880599999999}]
[null,"Razem płyta",{"$f":"SUM(C43,$C$45,$C$46)","v":15.995920599999998},{"$f":"SUM(D43,$D$45,$D$46)","v":16.233880599999999},100,"FALDA  SZKLO",{"$f":"Falda.szklo","v":26.381471999999999}]
[null,"Razem szkło",{"$f":"SUM(C44,$C$45,$C$46)","v":26.143511999999998},{"$f":"SUM(D44,$D$45,$D$46)","v":26.381471999999999},51,"FALDA  PLYTA LACZ",{"$f":"Falda.plyta.lacz","v":16.655176600000001}]
[null,"Łączniki",{"$f":"VLOOKUP(Wybrany.lacznik.przej,$E$30:$J$32,6,0)*Liczba.lacznikow*G17/1000","v":0.42129600000000006},{"$f":"C49","v":0.42129600000000006},101,"FALDA  SZKLO LACZ",{"$f":"Falda.szklo.lacz","v":26.802768}]
[null,"Razem płyta",{"$f":"C47+$C$49","v":16.4172166},{"$f":"D47+$D$49","v":16.655176600000001}]
[null,"Razem szkło",{"$f":"C48+$C$49","v":26.564807999999999},{"$f":"D48+$D$49","v":26.802768}]

{"sheet":"Opisy","index":6,"n_rows":474,"n_cols":9,"rows_kept":474,"cut":false,"hidden":true,"merged":[]}
["Wybór języka",1,null,null,{"$f":"Opisy!A48","v":"Błąd!"}]
[null,"Polski",null,null,{"$f":"Opisy!A49","v":"Niewłaściwy łącznik!"}]
[null,"English"]
[null,"Русский"]
[null,"Deutsch"]
[null,"Français"]
[null,{"$f":"Tabela1[[#Headers],[Українська]]","v":"Українська"}]
[null,"Lietuvos"]
[null,null,1,2,3,4,5,6,7]
["Tekst do wstawienia","Nr wiersza","PL","EN","RU","DE","FR","Українська","LT"]
[{"$f":"HLOOKUP($B$1,$C$9:$I$474,$B11,FALSE)","v":"Wybierz system:"},3,"Wybierz system:","Choose a system:","Выберите тип системы:","System auswählen:","Choix système:","Виберіть систему:","Pasirinkite sistema:"]
["Linia ERGO",4,"Linia ERGO","ERGO product line","Система ERGO","Linie ERGO","Ligne ERGO","Лінія ERGO","ERGO produktų linija"]
["Linia NOVO",5,"Linia NOVO","NOVO product line","Система NOVO","Linie NOVO","Ligne NOVO","Лінія NOVO","NOVO  produktų linija"]
["Wymiary otworu",6,"Wymiary otworu","Cavity inner dimensions","Размеры проема","Größe der Öffnung","Dimensions façade","Розмір отвору","Skylės matmenis "]
["<- MAX 2,74m",7,"<- MAX 2,74m","<- MAX 2,74m","<- MAX 2,74 м","<- MAX 2,74 m","<- MAX 2,74m","<- MAX 2,74м","<- MAX 2,74m"]
["<- MIN 1,0m",8,"<- MIN 1,0m","<- MIN 1,0m","<- MIN 1,0 м","<- MIN 1,0 m","<- MIN 1,0m","<- MIN 1,0м","<- MIN 1,0m"]
["<- OK",9,"<- OK","<- OK","<- OK","<- OK","<- OK","<- OK","<- OK"]
["WO [mm]",10,"WO [mm]","Cabinet height [mm]","Высота [мм]","H [mm]","WO [mm]","ВО  [мм]","Skylės aukštis [mm]"]
["SO [mm]",11,"SO [mm]","Cabinet width [mm]","Ширина [мм]","B [mm]","SO [mm]","ШО  [мм]","Skylės plotis [mm]"]
["<- MAX 6,0m",12,"<- MAX 6,0m","<- MAX 6,0m","<- MAX 6,0 м","<- MAX 6,0 m","<- MAX 6,0m","<- MAX 6,0м","<- MAX 6,0m"]
["Konfiguracja skrzydeł",13,"Konfiguracja skrzydeł","Door configuration","Конфигурация дверей","Konfiguration der Flügel","Configuration vantaux","Конфігурація дверей","Durų konfigūracija"]
["n (l. skrzydeł)",14,"n (l. skrzydeł)","n (no. of doors)","кол-во дверей","n (Anzahl von Flügeln)","n (nombre de vantaux)","n (к-сть. дверей)","n (durų skaičius )"]
["k (l. zakładek)",15,"k (l. zakładek)","k (no. of overlaps)","кол-во перехлестов","k (Anzahl von Überlappungen)","k (nombre de recouvrements)","k (к-сть. накладка)","k (persidengimų skaičius)"]
["z (szer. zakładki)",16,"z (szer. zakładki)","z (width of overlap)","ширина перехлеста","z (Breite der Überlappung)","z (largeur des recouvrements)","z (ширина накладки)","z (persidengimo plotis)"]
["Szczotka",17,"Szczotka","Pile brush seal","Щетка","Bürste","Brosse","Щітка","šepetėlis"]
["Uwaga:",18,"Uwaga:","Attention:","Внимание! ","Achtung:","Remarque:","Увага:","Dėmesio : "]
["Proporcje skrzydeł dla montażu mechanizmu samodociągu:",19,"Proporcje skrzydeł dla montażu mechanizmu samodociągu:","Proportions of the doors, for mounting the soft closing mechanism:","Пропорции дверей для монтажа механизма самодоката","Proportionen der Flügel für Montage des Selbsteinzugs:","Proportion vantail pour montage mécanisme soft-closing","Пропозиція крил для монтажу механізму самодотягу","Durų proporcijos  mechanizmo montavimui :"]
["* - Waga skrzydła została wyliczona dla wypełnienia wykonanego z płyty wiórowej (620kg/m3) lub szkła zwykłego o grubości 4mm (2800kg/m3), bez łączeń.",20,"* - Waga skrzydła została wyliczona dla wypełnienia wykonanego z płyty wiórowej (620kg/m3) lub szkła zwykłego o grubości 4mm (2800kg/m3), bez łączeń.","* - Weight was calculated for door made ​​of chipboard (620kg / m 3) or ordinary glass with a thickness of 4mm (2800kg / m 3), without joints.","* - Вес двери просчитан для наполнения из плиты ДСП (620 кг/м3) или стекла (2800 кг/м3) без соеденительных профилей.","* - Gewicht des Flügels wurde für Türen aus Pressspan (620 kg/m3) oder Glas mit einer Stärke von 4 mm (2800 kg/m3) ohne Verbindungen errechnet.","* - Poids du vantail calculé pour remplissage avec panneaux agglomérés (620kg/m3) ou verre d'épaisseur 4mm (2800kg/m3), sans joints.","* - Вага крила була розрахована для наповнення виконаного з ДСП  (620кг/м3) або звичайного скла товщиною 4мм (2800кг/м3), без з'єднань.","* -* -  Svoris buvo apskaičiuotas  durims pagamintoms  iš medžio drožlių plokštės (620kg / m 3) arba paprasto stiklo  4mm storio (2800kg / m 3), be siūlių."]
["Uwaga! Nie właściwa proporcja wysokości drzwi do szerokości. Zaleca się zmniejszyć liczbę skrzydeł.",21,"Uwaga! Nie właściwa proporcja wysokości drzwi do szerokości. Zaleca się zmniejszyć liczbę skrzydeł.","Attention! Wrong proportions between the door height and width. It is recommended to reduce the number of doors.","Внимание! Неправильная пропорция высоты двери к ширине. Рекомендуется уменьшить количество дверей.","Achtung! Das Höhe-Breite-Verhältnis der Türen stimmt nicht. Bitte ändern Sie die Anzahl der Flügel.","Attention! Inadaptation de la proportion entre la haut. et la larg. du vantail. Il est recommandé de réduire le nombre de vantaux.","Увага! Неправильна пропорція висоти до ширини дверей. Рекомендується зменшити кількість крил. ","Dėmesio! Klaidingos  durų proporcijos tarp aukščio ir pločio. Rekomenduojama sumažinti durų sk."]
["Proporcje są OK",22,"Proporcje są OK","Proportions are OK","Пропорции ОК","Die Proportionen sind OK. ","Les proportions sont correctes","Правильна пропорція","Proporcijos yra tinkamos"]
["Łączniki",23,"Łączniki","Joints","Соединители","Verbindung","Joints","З'єднання","Jungtys "]
["Obliczenia wysokości wypełnień łączonych",24,"Obliczenia wysokości wypełnień łączonych","Calculation of heght with combined infills","Расчет высоты соединяемых наполнений","Berechnung der Höhe der verbundenen Füllungen","Calcul de la hauteur de remplissage des joints","Розрахунок висоти використаних наповнень"," Užpildo jungties aukščio apskaičiavimas"]
["Wybierz łącznik:",25,"Wybierz łącznik:","Choose a joint:","Выбери соединитель:","Verbindung auswählen:","Choix des joints","Виберіть з'єднання.","Pasirinkite jungti:"]
["Równomierne rozłożenie łączników.",26,"Równomierne rozłożenie łączników.","Joints split door infills to equal panels","Равномерное распределение соединителей.","Gleichmäßige Verteilung der Verbinder","Disposition uniforme des joints","Рівномірне розподілення з'єднань.","Tolygus jungčių pasiskirstymas"]
[" Jedna grubość wypełnienia",27," Jedna grubość wypełnienia","The same thickness of infills","Одна ширина наполнения","Gleiche Stärke der Füllung","L'épaisseur du remplissage","Одна товщина наповнення","Tas pats užpildo storis"]
["i (ilość łączników)",28,"i (ilość łączników)","i (number of joiners)","кол-во соединителей","und (Anzahl der Verbindungen)","i (nombre de joints)","і (кількість з'єднань)","i ( Jungčių kiekis)"]
["Liczba elementów składowych",29,"Liczba elementów składowych","The number of elements","Кол-во деталей","Anzahl der Elemente","Nombre d'éléments","Кількість деталей","Elementų skaičius"]
["Elementy z płyty",30,"Elementy z płyty","Chipboard parts","Элементы из плиты","Elemente aus Pressspan","Eléments en aggloméré","Елементи з плити","Elementai pagaminti iš plokštės"]
["Wys. wyp. z płyty bez łączników",31,"Wys. wyp. z płyty bez łączników","Board height without joiners","Выс. нап. из плиты без соед.","Höhe der Spanplatten ohne Verbindung","H remp. en aggloméré sans joints","Вис. нап. з плити без з'єднань","Plokštės elementų aukštis be jungčių"]
["A (wys. elementów z płyty)",32,"A (wys. elementów z płyty)","A (single board panel height)","А (выс. элементов из плиты)","A (Höhe der Spanplatten)","A (haut. éléments en aggloméré)","A (висота елементів з плити)","A (plokštės elementų aukštis)"]
["B (wys. elementów z płyty)",33,"B (wys. elementów z płyty)","B (single board panel height)","B (выс. элементов из плиты)","B (Höhe der Spanplatten)","B (haut. éléments en aggloméré)","B (висота елементів з плити)","B (plokštės elementų aukštis)"]
["Elementy ze szkła 4mm",34,"Elementy ze szkła 4mm","Glass elements 4mm","Элементы из стекла 4 мм","Glasselemente 4mm","Eléments en verre 4mm","Елементи з скла 4мм","Stiklo elementai  4mm"]
["Wys. wyp. 4mm bez łączników",35,"Wys. wyp. 4mm bez łączników","Infill height 4mm without joiners","Выс. нап. 4 мм без соед.","Höhe der Füllung ohne Verbindung 4mm","Haut rempl. 4 mm sans joints","Вис. наповнення 4мм без з'єднань","Užpildo aukštis 4mm be jungcių"]
["C (wys. elementów ze szkła 4mm)",36,"C (wys. elementów ze szkła 4mm)","C (single glass 4mm panel height)","C (выс. элементов из стекла 4 мм)","C (Höhe der Glaselemente 4mm)","C (hauteur éléments en verre 4mm)","C (висота елементів із скла 4мм)","C (stiklo elementų aukštis 4mm)"]
["szt.",37,"szt.","pcs.","шт.","Stk.","ex.","шт.","vnt."]
["mm",38,"mm","mm","мм","mm","mm","мм","mm"]
["mm*",39,"mm*","mm*","мм*","mm*","mm*","мм*","mm*"]
["Błąd!",40,"Błąd!","Error!","Ошибка!","Fehler!","Erreur!","Помилка!","Klaida!"]
["Niewłaściwy łącznik!",41,"Niewłaściwy łącznik!","Incorrect joiner!","Неверный соединитель!","Falsche Verbindung!","Joint incorrect !","Не правильне з'єднання!","Netinkamas jungtis!"]
["* - Uwaga! W systemie 18/4, przy łączeniu wypełnień o różnych grubościach (płyta, szkło), został założony luz dla szkła wynoszący 0,5mm na każdy element. W konfiguracji, gdzie występuje tylko jedno wypełnienie szklane, należy od jego wysokości odjąć 1mm, aby zwiększyć luz. ",42,"* - Uwaga! W systemie 18/4, przy łączeniu wypełnień o różnych grubościach (płyta, szkło), został założony luz dla szkła wynoszący 0,5mm na każdy element. W konfiguracji, gdzie występuje tylko jedno wypełnienie szklane, należy od jego wysokości odjąć 1mm, aby zwiększyć luz. ","Attention! In system 18/4, when combining different infill thickness (board, glass), there is an assumed gap for glass 0,5mm on every element. If there is only 1 glass infill, You should deduct 1mm, to make the gap bigger.  ","Внимание! Система  18/4 запроектирована таким образом, что, при соединении наполнений разной толщины (плита, стекло), остается люфт для стекла в 0,5 мм на каждом элементе. В конфигурации, где имеется только стеклянное наполнение, необходимо отнять от его высоты 1 мм, чтобы увеличить люфт.","* - Achtung! Im System 18/4 bei Verbindung von Füllungen unterschiedlicher Stärken (Spanplatte, Glas) wurde eine Lücke für Glas von 0,5 mm für jedes Element angenommen. Bei der Konfiguration, in der nur eine Glasfüllung vorliegt, muss von ihrer Höhe 1 mm abgezogen werden, um die Lücke zu vergrößern.","* - Attention! Pour le systeme 18/4 en additionant des remplissages de différentes épaisseurs  (aggloméré, verre) une marge a été créé pour le montant en verre de 0,5 mm sur chaque élément.  Dans une configuration où il n'y a qu'un seul remplissage de verre, soustraite 1 mm de sa hauteur pour  augmenter l'espace ","* - Увага! В системі 18/4, при з'єднанні наповнень різної товщини (плита, скло), врахований зазор для скла в розмірі 0,5мм на кожен елемент. В конфігурації, де є тільки скляне наповнення, потрібно від його висоти відняти 1 мм, щоб збільшити зазор.","* - Dėmesio! Sistemoje 18/4, derinant skirtingus užpildų storius (plokštė, stiklas), yra   kiekvienam stiklų elementui padarytas  0,5 mm laisvumas . Jei yra tik 1 stiklinis užpildas, nuo jo aukščio reikia atskaičiuoti 1mm, kad padidinti laisvumą."]
["Szerokość drzwi",43,"Szerokość drzwi","Door width","Ширина дверей","Breite der Tür","Largeur vantail","Ширина дверей","Durų plotis"]
["Wysokość drzwi",44,"Wysokość drzwi","Door height","Высота дверей","Höhe der Tür","Hauteur vantail","Висота дверей","Durų aukštis"]
["Szer. wyp. 18mm",45,"Szer. wyp. 18mm","Board 18mm width","Шир. наполнения 18 мм","Breite der Füllung 18 mm","Largeur remplissage 18mm","Ширина наповнення - 18мм","lent. pl. 18mm"]
["Szer. wyp. 16mm",46,"Szer. wyp. 16mm","Board 16mm width","Шир. наполнения 16 мм","Breite der Füllung 16 mm","Largeur remplissage 16mm","Ширина наповнення - 16мм","lent. pl 16mm"]
["Szer. wyp. 12mm",47,"Szer. wyp. 12mm","Board 12mm width","Шир. наполнения 12 мм","Breite der Füllung 12 mm","Largeur remplissage 12mm","Ширина наповнення - 12мм","lent. pl  12mm"]
["Szer. wyp. 10mm",48,"Szer. wyp. 10mm","Board 10mm width","Шир. наполнения 10 мм","Breite der Füllung 10 mm","Largeur remplissage 10mm","Ширина наповнення - 10мм","lent. pl  10mm"]
["Szer. wyp. 4mm",49,"Szer. wyp. 4mm","Glass 4mm width","Шир. наполнения 4 мм","Breite der Füllung 4 mm","Largeur remplissage 4mm","Ширина наповнення - 4мм","lent. pl  4mm"]
["Wys. wyp. 18mm",50,"Wys. wyp. 18mm","Board 18mm height","Выс. наполнения 18 мм","Höhe der Füllung 18 mm","Hauteur remplissage 18mm","Висота наповнення - 18мм","lent. pl  18mm"]
["Wys. wyp. 16mm",51,"Wys. wyp. 16mm","Board 16mm height","Выс. наполнения 16 мм","Höhe der Füllung 16 mm","Hauteur remplissage 16mm","Висота наповнення - 16мм","lent. pl  16mm"]
["Wys. wyp. 12mm",52,"Wys. wyp. 12mm","Board 12mm height","Выс. наполнения 12 мм","Höhe der Füllung 12 mm","Hauteur remplissage 12mm","Висота наповнення - 12мм","lent. pl  12mm"]
["Wys. wyp. 10mm",53,"Wys. wyp. 10mm","Board 10mm height","Выс. наполнения 10 мм","Höhe der Füllung 10 mm","Hauteur remplissage 10mm","Висота наповнення - 10мм","lent. pl  10mm"]
["Wys. wyp. 4mm",54,"Wys. wyp. 4mm","Glass 4mm height","Выс. наполнения 4 мм","Höhe der Füllung 4 mm","Hauteur remplissage 4mm","Висота наповнення - 4мм","lent. pl  4mm"]
["Długość rączki",55,"Długość rączki","Handle length","Длина ручки","Länge des Griffs","Longueur poignee","Довжина ручки","Rankenos ilgis"]
["Dł. listew poz.",56,"Dł. listew poz.","Rail length","Длина поперечных профилей","Länge der Leiste","Longueur du rail","Довжина горизон. проф.","Likusių plokščių ilgis"]
["Waga skrzydła z wypełnieniem z płyty",57,"Waga skrzydła z wypełnieniem z płyty","Door weight with chipboard infill","Вес двери с наполнением из плиты ДСП","Gewicht des Flügels mit Pressspanfüllung","Poids de la porte avec remplissage panneau","Вага дверей з наповненням із плити","Durų svoris su užpildu iš plokštės"]
["Waga skrzydła z wypełnieniem ze szkła",58,"Waga skrzydła z wypełnieniem ze szkła","Door weight with glass infill","Вес двери с наполнением из стекла","Gewicht des Flügels mit Glasfüllung","Poids de la porte avec remplissage verre","Вага дверей з наповненням із скла","Durų svoris su užpildu iš stiklo "]
["kg",59,"kg","kg","кг","kg","kg","кг","kg"]
["Zwiększ ilość zakładek",60,"Zwiększ ilość zakładek","Increase the number of ocerlaps","Необходимо увеличить кол-во перехлестов","Vergrößere die Anzahl von Überlappungen","Augmenter nbre recouvrements","Збільшити кількість накладок","Padidinti persidengimų skaičių"]
["Zmniejsz ilość zakładek",61,"Zmniejsz ilość zakładek","Reduce the number of overlaps","Необходимо уменьшить кол-во перехлестов","Verkleinere die Anzahl von Überlappungen","Modifier nbre recouvrements","Зменшити кількість накладок","Sumažinti persidengimų skaičių"]
["N/D",62,"N/D","N/A","Н/Д","n. z.","N/D","Н/Д","N/D"]
["------RAMOWE 18mm--------------",63,"------RAMOWE 18mm--------------","-------FRAME 18mm--------------","-----------Pама 18мм--------------","----Alu-Rahmen 18 mm-----------","--------Cadre 18mm--------------","---------Pама 18мм--------------","------RĖMAS 18mm--------------"]
["------RAMOWE 10mm--------------",64,"------RAMOWE 10mm--------------","-------FRAME 10mm--------------","-----------Pама 10мм--------------","----Alu-Rahmen 10 mm-----------","--------Cadre 10mm--------------","---------Pама 10мм--------------","------RĖMAS 10mm--------------"]
["Sprawdź ilość zakładek! W większości przypadków, różnica pomiędzy ilością skrzydeł a ilością zakładek wynosi 1. Wyjątkiem może być zabudowa z czteroma skrzydłami w układzie symetrycznym, gdzie ta różnica wnosi 2 (patrz katalog).",65,"Sprawdź ilość zakładek! W większości przypadków, różnica pomiędzy ilością skrzydeł a ilością zakładek wynosi 1. Wyjątkiem może być zabudowa z czteroma skrzydłami w układzie symetrycznym, gdzie ta różnica wnosi 2 (patrz katalog).","Check the number of overlaps! In the most cases, the difference between the amount of wings and overlaps is one. The exception can be  a development with four wings in the symmetric system  , where the difference is 2 ( check the catalogue).","Проверь количество перехлёстов! В большинстве случаев разница между количеством дверей и количеством перехлёстов равно 1. Исключением является конфигурация с четырьмя дверями в ассиметричном варианте исполнения, где разница равна 2 (смотрите каталог!)","Prüfen Sie die Anzahl der Überlappungen! In den meisten Fällen beträgt die Differenz zwischen der Anzahl der Flügel und der Anzahl der Überlappungen 1. Eine Ausnahme kann das vierflügelige Schiebetürsystem mit vier Flügeln in symmetrischer Verteilung bilden, wo diese Differenz 2 beträgt (siehe Katalog).","Vérifier le nombre de recouvrements ! Dans la plupart des cas, la différence entre le nombre de recouvrements et de vantaux est de 1. Une exception peut – être le montage de 4 vantaux symétriques, lorsque cette différence est de 2 (voir catalogue).","У більшості випадків, різниця між кількістю крил і кількість вкладок дорівнює 1. Винятком може бути будова з чотирма крилами в симетричному розташуванні, де різниця дорівнює 2 (див. каталог).","Patikrinkite persidengimų skaičių!  Daugeliu atvejų, skirtumas tarp durų sk. ir persidengimų yra 1. Išimčiu gali būti simetriškoje sistemoje  imontuojant 4 duris. Skirtumas yra 2 (žiurėkite katalogą)\n"]
["Waga skrzydła z wypełnieniem z płyty 18mm",66,"Waga skrzydła z wypełnieniem z płyty 18mm","Door weight with chipboard infill - 18mm","Вес двери с наполнением из плиты ДСП - 18мм","Gewicht des Flügels mit Pressspanfüllung - 18mm","Poids de la porte avec remplissage panneau - 18mm","Вага дверей з наповненням із плити - 18мм","Durų svoris su užpildu iš plokštės - 18mm"]
[{"$f":"HLOOKUP($B$1,$C$9:$I$474,$B75,FALSE)","v":"Waga skrzydła z wypełnieniem z płyty 16mm"},67,"Waga skrzydła z wypełnieniem z płyty 16mm","Door weight with chipboard infill - 16mm","Вес двери с наполнением из плиты ДСП - 16мм","Gewicht des Flügels mit Pressspanfüllung - 16mm","Poids de la porte avec remplissage panneau - 16mm","Вага дверей з наповненням із плити - 16мм","Durų svoris su užpildu iš plokštės - 16mm"]
["<- MAX 3,0m",68,"<- MAX 3,0m","<- MAX 3,0m","<- MAX 3,0 м","<- MAX 3,0 m","<- MAX 3,0m","<- MAX 3,0м","<- MAX 3,0m"]
["Wymiary dla:",69,"Wymiary dla:"]
["Wnęki",70,"Wnęki"]
["Korpusu szafy",71,"Korpusu szafy"]
["Wysokość:",72,"Wysokość:"]
["Szerokość:",73,"Szerokość:"]
["Głębokość:",74,"Głębokość:"]
["Maksimum 3000mm",75,"Maksimum 3000mm"]
["Maksimum 4050mm",76,"Maksimum 4050mm"]
["Grubość płyty na korpus Gp:",77,"Grubość płyty na korpus Gp:"]
["Wysokość cokołu Hc :",78,"Wysokość cokołu Hc :"]
["Grubość płyty drzwi Gd:",79,"Grubość płyty drzwi Gd:"]
["Szerokość zakładki Z:",80,"Szerokość zakładki Z:"]
["mm (minimum 16 mm)",81,"mm (minimum 16 mm)"]
["mm (minimum 50 mm)",82,"mm (minimum 50 mm)"]
["mm (16 - 22 mm)",83,"mm (16 - 22 mm)"]
["mm (minimum 20 mm)",84,"mm (minimum 20 mm)"]
["<--Zwiększ szerokość zakładki",85,"<--Zwiększ szerokość zakładki"]
["Wymiary szafy - drzwi nakładane",86,"Wymiary szafy - drzwi nakładane"]
["Korpus:",87,"Korpus:"]
["Wysokość Ws:",88,"Wysokość Ws:"]
["Szerokość Ss:",89,"Szerokość Ss:"]
["Głębokość Gs:",90,"Głębokość Gs:"]
["Wnętrze korpusu:",91,"Wnętrze korpusu:"]
["Wysokość Wu:",92,"Wysokość Wu:"]
["Szerokość Sw:",93,"Szerokość Sw:"]
["Głębokość Gu:",94,"Głębokość Gu:"]
["Wieniec górny i dolny:",95,"Wieniec górny i dolny:"]
["Wymiary cokołu:",96,"Wymiary cokołu:"]
["Bok lewy:",97,"Bok lewy:"]
["Bok prawy:",98,"Bok prawy:"]
["Przegrody pionowe:",99,"Przegrody pionowe:"]
["Wymiary drzwi:",100,"Wymiary drzwi:"]
["Wymiary szafy - drzwi wpuszczane",101,"Wymiary szafy - drzwi wpuszczane"]
["Wysokość Wd:",102,"Wysokość Wd:"]
["Szerokość Sd:",103,"Szerokość Sd:"]
["Grubość Gd:",104,"Grubość Gd:"]
["Notatki:",105,"Notatki:"]
["Grubość:",106,"Grubość:"]
["Opcje montażu:",107,"Opcje montażu:"]
["Bezpośredni montaż do sufitu",108,"Bezpośredni montaż do sufitu"]
["Montaż do sufitu  - uchwyt górny",109,"Montaż do sufitu  - uchwyt górny"]
["Montaż do ściany - uchwyt boczny",110,"Montaż do ściany - uchwyt boczny"]
["Dostępne grubości wypełnienia:",111,"Dostępne grubości wypełnienia:"]
["Wymiary otworu:",112,"Wymiary otworu:"]
["Wysokość WO:",113,"Wysokość WO:"]
["Szerokość SO:",114,"Szerokość SO:"]
["<----- Dla ukrytego prowadnika Xmin = 46mm",115,"<----- Dla ukrytego prowadnika Xmin = 46mm"]
["Wybór zabudowy:",116,"Wybór zabudowy:"]
["Wariant A",117,"Wariant A"]
["Wariant B",118,"Wariant B"]
["Długość toru",119,"Długość toru"]
["Wyliczenia dla rozwiązania bezramowego (Quantum)",120,"Wyliczenia dla rozwiązania bezramowego (Quantum)"]
["Wyliczenia dla rozwiązania ramowego (Quantum R)",121,"Wyliczenia dla rozwiązania ramowego (Quantum R)"]
["Wymiary wypełnienia z płyty 10mm",122,"Wymiary wypełnienia z płyty 10mm"]
["Wymiary wypełnienia ze szkła 4mm",123,"Wymiary wypełnienia ze szkła 4mm"]
["Wymiary profili aluminiowych",124,"Wymiary profili aluminiowych"]
["Szerokość zakładki X:",125,"Szerokość zakładki X:"]
["Wymiary skrzydła drzwi:",126,"Wymiary skrzydła drzwi:"]
["Wys. el. z płyty",127,"Wys. el. z płyty"]
["Wys. el. ze szkła",128,"Wys. el. ze szkła"]
["Minimum 300mm",129,"Minimum 300mm"]
["W systemach Quantum R maksymalna wysokoś drzwi wynosi 2,7m",130,"W systemach Quantum R maksymalna wysokoś drzwi wynosi 2,7m"]
[{"$f":"HLOOKUP($B$1,$C$9:$I$474,$B139,FALSE)","v":"Maksymalna długość łącznika A-HR10FL wynosi 3m"},131,"Maksymalna długość łącznika A-HR10FL wynosi 3m"]
["Maksymalna długość łączników A-HRS10 i A-HR10 wynosi 6m",132,"Maksymalna długość łączników A-HRS10 i A-HR10 wynosi 6m"]
["Waga skrzydła [kg]",133,"Waga skrzydła [kg]"]
["Przekroczono dopuszczalną wagę skrzydła 50kg",134,"Przekroczono dopuszczalną wagę skrzydła 50kg"]
["Max 3m",135,"Max 3m"]
[0,136]
[0,137]
[0,138]
[0,139]
[0,140]
[0,141]
[0,142]
[0,143]
[0,144]
[0,145]
[0,146]
[0,147]
[0,148]
[0,149]
[0,150]
[0,151]
[0,152]
[0,153]
[0,154]
[0,155]
[0,156]
[0,157]
[0,158]
[0,159]
[0,160]
[0,161]
[0,162]
[0,163]
[0,164]
[0,165]
[0,166]
[0,167]
[0,168]
[0,169]
[0,170]
[0,171]
[0,172]
[0,173]
[0,174]
[0,175]
[0,176]
[0,177]
[0,178]
[0,179]
[0,180]
[0,181]
[0,182]
[0,183]
[0,184]
[0,185]
[0,186]
[0,187]
[0,188]
[0,189]
[0,190]
[0,191]
[0,192]
[0,193]
[0,194]
[{"$f":"HLOOKUP($B$1,$C$9:$I$474,$B203,FALSE)","v":0},195]
[0,196]
[0,197]
[0,198]
[0,199]
[0,200]
[0,201]
[0,202]
[0,203]
[0,204]
[0,205]
[0,206]
[0,207]
[0,208]
[0,209]
[0,210]
[0,211]
[0,212]
[0,213]
[0,214]
[0,215]
[0,216]
[0,217]
[0,218]
[0,219]
[0,220]
[0,221]
[0,222]
[0,223]
[0,224]
[0,225]
[0,226]
[0,227]
[0,228]
[0,229]
[0,230]
[0,231]
[0,232]
[0,233]
[0,234]
[0,235]
[0,236]
[0,237]
[0,238]
[0,239]
[0,240]
[0,241]
[0,242]
[0,243]
[0,244]
[0,245]
[0,246]
[0,247]
[0,248]
[0,249]
[0,250]
[0,251]
[0,252]
[0,253]
[0,254]
[0,255]
[0,256]
[0,257]
[0,258]
[{"$f":"HLOOKUP($B$1,$C$9:$I$474,$B267,FALSE)","v":0},259]
[0,260]
[0,261]
[0,262]
[0,263]
[0,264]
[0,265]
[0,266]
[0,267]
[0,268]
[0,269]
[0,270]
[0,271]
[0,272]
[0,273]
[0,274]
[0,275]
[0,276]
[0,277]
[0,278]
[0,279]
[0,280]
[0,281]
[0,282]
[0,283]
[0,284]
[0,285]
[0,286]
[0,287]
[0,288]
[0,289]
[0,290]
[0,291]
[0,292]
[0,293]
[0,294]
[0,295]
[0,296]
[0,297]
[0,298]
[0,299]
[0,300]
[0,301]
[0,302]
[0,303]
[0,304]
[0,305]
[0,306]
[0,307]
[0,308]
[0,309]
[0,310]
[0,311]
[0,312]
[0,313]
[0,314]
[0,315]
[0,316]
[0,317]
[0,318]
[0,319]
[0,320]
[0,321]
[0,322]
[{"$f":"HLOOKUP($B$1,$C$9:$I$474,$B331,FALSE)","v":0},323]
[0,324]
[0,325]
[0,326]
[0,327]
[0,328]
[0,329]
[0,330]
[0,331]
[0,332]
[0,333]
[0,334]
[0,335]
[0,336]
[0,337]
[0,338]
[0,339]
[0,340]
[0,341]
[0,342]
[0,343]
[0,344]
[0,345]
[0,346]
[0,347]
[0,348]
[0,349]
[0,350]
[0,351]
[0,352]
[0,353]
[0,354]
[0,355]
[0,356]
[0,357]
[0,358]
[0,359]
[0,360]
[0,361]
[0,362]
[0,363]
[0,364]
[0,365]
[0,366]
[0,367]
[0,368]
[0,369]
[0,370]
[0,371]
[0,372]
[0,373]
[0,374]
[0,375]
[0,376]
[0,377]
[0,378]
[0,379]
[0,380]
[0,381]
[0,382]
[0,383]
[0,384]
[0,385]
[0,386]
[{"$f":"HLOOKUP($B$1,$C$9:$I$474,$B395,FALSE)","v":0},387]
[0,388]
[0,389]
[0,390]
[0,391]
[0,392]
[0,393]
[0,394]
[0,395]
[0,396]
[0,397]
[0,398]
[0,399]
[0,400]
[0,401]
[0,402]
[0,403]
[0,404]
[0,405]
[0,406]
[0,407]
[0,408]
[0,409]
[0,410]
[0,411]
[0,412]
[0,413]
[0,414]
[0,415]
[0,416]
[0,417]
[0,418]
[0,419]
[0,420]
[0,421]
[0,422]
[0,423]
[0,424]
[0,425]
[0,426]
[0,427]
[0,428]
[0,429]
[0,430]
[0,431]
[0,432]
[0,433]
[0,434]
[0,435]
[0,436]
[0,437]
[0,438]
[0,439]
[0,440]
[0,441]
[0,442]
[0,443]
[0,444]
[0,445]
[0,446]
[0,447]
[0,448]
[0,449]
[0,450]
[{"$f":"HLOOKUP($B$1,$C$9:$I$474,$B459,FALSE)","v":0},451]
[0,452]
[0,453]
[0,454]
[0,455]
[0,456]
[0,457]
[0,458]
[0,459]
[0,460]
[0,461]
[0,462]
[0,463]
[0,464]
[0,465]
[0,466]